{"text_format":"1","workbook":"xlsx","n_sheets":44,"sheets":["Admin","Generated Tables","Template","Instructions","Project","Association Table","Bridges","Traffic_Facilities","Drainage","Features","Footpaths","Islands","ITS","Markings","Minor_Structures","Pavement","Pavement_Test_Pit","Railings","Retaining_Walls","Shoulders","Sign","SL_Bracket","SL_Light","SL_Pole","Surfacing","SW_Channel","Trees or Gardens","LU General","LU Features","LU SW_Channel","LU Bridges","LU Pavement","LU Markings","LU Road Names","LU Drainage","LU Railings","LU Sign","LU Surfacing","LU Footpaths","LU Islands","LU ITS","LU Streetlights","LU Retaining_Walls","LU Minor_Structures"],"not_rendered":{"charts":0,"images":6,"macros":1,"external_links":1,"defined_names":7,"comments":0,"pivot_tables":0},"unopened":[],"bounds":{"document_bytes":16777216,"sheet_cells":100000,"rows_first":2000,"rows_last":500,"rows_between":2000,"halvings":0,"cell_chars":16384,"cell_head_chars":4096},"cells_cut":0,"cells_raw":0,"read":"whole","date_system":"1900"}

{"sheet":"Admin","index":0,"n_rows":15,"n_cols":50,"rows_kept":15,"cut":false,"hidden":true,"merged":[]}
[]
[]
[]
[]
["Table Name","Markings","New"]
["Number of rows",{"$f":"INDEX(data_summary[],MATCH($B$5,data_summary[Asset Type],0),MATCH($C$5,data_summary[#Headers],0))","v":0}]
[]
[null,"G:\\000 - ONMC WestLink\\RAMM\\Bulk Load\\Signs"]
["Filename",20180919]
[]
[]
[]
[null,null,"road_id","start_m","end_m","start_name","end_name","surf_offset","surf_width","sealed_area","sealed_area_ok","surf_depth","surf_material","surface_date","removed_date","full_width_flag","lane_coverage","surf_function","use_calc_depth","chip_size","chip_2nd_size","pave_source","surf_binder","flux","cutter","cutter_type","adhesion","surf_adhesion","additive","surf_additive","polymer_type","polymer_mod_pcnt","elastic_recovery","softening_point","rate","contract_number","organisation","surf_spec","polished_stone","average_dim","recycling","surf_recycled_cpnt","pct_recycled","surf_reason","work_origin_id","design_life","original_cost","notes","condition","use_default_rc"]
[null,null,{"$f":"IF(ISBLANK(INDEX(INDIRECT($B$5&\"_\"&$C$5),ROW()-13,MATCH(INDEX(INDIRECT($B$5&\"_key\"),MATCH(C$13,INDIRECT($B$5&\"_key[RAMM field name]\"),0),1),INDIRECT($B$5&\"_\"&$C$5&\"[#Headers]\"),0))),\nIF(INDEX(INDIRECT($B$5&\"_key\"),MATCH(C$13,INDIRECT($B$5&\"_key[RAMM field name]\"),0),6)=\"Y\",\"\"&INDEX(INDIRECT($B$5&\"_key\"),MATCH(C$13,INDIRECT($B$5&\"_key[RAMM field name]\"),0),7),\"\"),\nIF(INDEX(INDIRECT($B$5&\"_key\"),MATCH(C$13,INDIRECT($B$5&\"_key[RAMM field name]\"),0),3)=\"lookup\",\nINDEX(INDIRECT(INDEX(INDIRECT($B$5&\"_key\"),MATCH(C$13,INDIRECT($B$5&\"_key[RAMM field name]\"),0),4)),\nMATCH(INDEX(INDIRECT($B$5&\"_\"&$C$5),ROW()-13,MATCH(INDEX(INDIRECT($B$5&\"_key\"),MATCH(C$13,INDIRECT($B$5&\"_key[RAMM field name]\"),0),1),INDIRECT($B$5&\"_\"&$C$5&\"[#Headers]\"),0)),\nINDIRECT(INDEX(INDIRECT($B$5&\"_key\"),MATCH(C$13,INDIRECT($B$5&\"_key[RAMM field name]\"),0),4)&\"[\"&INDEX(INDIRECT($B$5&\"_key\"),MATCH(C$13,INDIRECT($B$5&\"_key[RAMM field name]\"),0),2)&\"]\"),0),1),\nINDEX(INDIRECT($B$5&\"_\"&$C$5),ROW()-13,MATCH(INDEX(INDIRECT($B$5&\"_key\"),MATCH(C$13,INDIRECT($B$5&\"_key[RAMM field name]\"),0),1),INDIRECT($B$5&\"_\"&$C$5&\"[#Headers]\"),0))))","v":""},{"$f":"IF(ISBLANK(INDEX(INDIRECT($B$5&\"_\"&$C$5),ROW()-13,MATCH(INDEX(INDIRECT($B$5&\"_key\"),MATCH(D$13,INDIRECT($B$5&\"_key[RAMM field name]\"),0),1),INDIRECT($B$5&\"_\"&$C$5&\"[#Headers]\"),0))),\nIF(INDEX(INDIRECT($B$5&\"_key\"),MATCH(D$13,INDIRECT($B$5&\"_key[RAMM field name]\"),0),6)=\"Y\",\"\"&INDEX(INDIRECT($B$5&\"_key\"),MATCH(D$13,INDIRECT($B$5&\"_key[RAMM field name]\"),0),7),\"\"),\nIF(INDEX(INDIRECT($B$5&\"_key\"),MATCH(D$13,INDIRECT($B$5&\"_key[RAMM field name]\"),0),3)=\"lookup\",\nINDEX(INDIRECT(INDEX(INDIRECT($B$5&\"_key\"),MATCH(D$13,INDIRECT($B$5&\"_key[RAMM field name]\"),0),4)),\nMATCH(INDEX(INDIRECT($B$5&\"_\"&$C$5),ROW()-13,MATCH(INDEX(INDIRECT($B$5&\"_key\"),MATCH(D$13,INDIRECT($B$5&\"_key[RAMM field name]\"),0),1),INDIRECT($B$5&\"_\"&$C$5&\"[#Headers]\"),0)),\nINDIRECT(INDEX(INDIRECT($B$5&\"_key\"),MATCH(D$13,INDIRECT($B$5&\"_key[RAMM field name]\"),0),4)&\"[\"&INDEX(INDIRECT($B$5&\"_key\"),MATCH(D$13,INDIRECT($B$5&\"_key[RAMM field name]\"),0),2)&\"]\"),0),1),\nINDEX(INDIRECT($B$5&\"_\"&$C$5),ROW()-13,MATCH(INDEX(INDIRECT($B$5&\"_key\"),MATCH(D$13,INDIRECT($B$5&\"_key[RAMM field name]\"),0),1),INDIRECT($B$5&\"_\"&$C$5&\"[#Headers]\"),0))))","v":""},{"$f":"IF(ISBLANK(INDEX(INDIRECT($B$5&\"_\"&$C$5),ROW()-13,MATCH(INDEX(INDIRECT($B$5&\"_key\"),MATCH(E$13,INDIRECT($B$5&\"_key[RAMM field name]\"),0),1),INDIRECT($B$5&\"_\"&$C$5&\"[#Headers]\"),0))),\nIF(INDEX(INDIRECT($B$5&\"_key\"),MATCH(E$13,INDIRECT($B$5&\"_key[RAMM field name]\"),0),6)=\"Y\",\"\"&INDEX(INDIRECT($B$5&\"_key\"),MATCH(E$13,INDIRECT($B$5&\"_key[RAMM field name]\"),0),7),\"\"),\nIF(INDEX(INDIRECT($B$5&\"_key\"),MATCH(E$13,INDIRECT($B$5&\"_key[RAMM field name]\"),0),3)=\"lookup\",\nINDEX(INDIRECT(INDEX(INDIRECT($B$5&\"_key\"),MATCH(E$13,INDIRECT($B$5&\"_key[RAMM field name]\"),0),4)),\nMATCH(INDEX(INDIRECT($B$5&\"_\"&$C$5),ROW()-13,MATCH(INDEX(INDIRECT($B$5&\"_key\"),MATCH(E$13,INDIRECT($B$5&\"_key[RAMM field name]\"),0),1),INDIRECT($B$5&\"_\"&$C$5&\"[#Headers]\"),0)),\nINDIRECT(INDEX(INDIRECT($B$5&\"_key\"),MATCH(E$13,INDIRECT($B$5&\"_key[RAMM field name]\"),0),4)&\"[\"&INDEX(INDIRECT($B$5&\"_key\"),MATCH(E$13,INDIRECT($B$5&\"_key[RAMM field name]\"),0),2)&\"]\"),0),1),\nINDEX(INDIRECT($B$5&\"_\"&$C$5),ROW()-13,MATCH(INDEX(INDIRECT($B$5&\"_key\"),MATCH(E$13,INDIRECT($B$5&\"_key[RAMM field name]\"),0),1),INDIRECT($B$5&\"_\"&$C$5&\"[#Headers]\"),0))))","v":""},{"$f":"IF(ISBLANK(INDEX(INDIRECT($B$5&\"_\"&$C$5),ROW()-13,MATCH(INDEX(INDIRECT($B$5&\"_key\"),MATCH(F$13,INDIRECT($B$5&\"_key[RAMM field name]\"),0),1),INDIRECT($B$5&\"_\"&$C$5&\"[#Headers]\"),0))),\nIF(INDEX(INDIRECT($B$5&\"_key\"),MATCH(F$13,INDIRECT($B$5&\"_key[RAMM field name]\"),0),6)=\"Y\",\"\"&INDEX(INDIRECT($B$5&\"_key\"),MATCH(F$13,INDIRECT($B$5&\"_key[RAMM field name]\"),0),7),\"\"),\nIF(INDEX(INDIRECT($B$5&\"_key\"),MATCH(F$13,INDIRECT($B$5&\"_key[RAMM field name]\"),0),3)=\"lookup\",\nINDEX(INDIRECT(INDEX(INDIRECT($B$5&\"_key\"),MATCH(F$13,INDIRECT($B$5&\"_key[RAMM field name]\"),0),4)),\nMATCH(INDEX(INDIRECT($B$5&\"_\"&$C$5),ROW()-13,MATCH(INDEX(INDIRECT($B$5&\"_key\"),MATCH(F$13,INDIRECT($B$5&\"_key[RAMM field name]\"),0),1),INDIRECT($B$5&\"_\"&$C$5&\"[#Headers]\"),0)),\nINDIRECT(INDEX(INDIRECT($B$5&\"_key\"),MATCH(F$13,INDIRECT($B$5&\"_key[RAMM field name]\"),0),4)&\"[\"&INDEX(INDIRECT($B$5&\"_key\"),MATCH(F$13,INDIRECT($B$5&\"_key[RAMM field name]\"),0),2)&\"]\"),0),1),\nINDEX(INDIRECT($B$5&\"_\"&$C$5),ROW()-13,MATCH(INDEX(INDIRECT($B$5&\"_key\"),MATCH(F$13,INDIRECT($B$5&\"_key[RAMM field name]\"),0),1),INDIRECT($B$5&\"_\"&$C$5&\"[#Headers]\"),0))))","v":{"$error":"#N/A"}},{"$f":"IF(ISBLANK(INDEX(INDIRECT($B$5&\"_\"&$C$5),ROW()-13,MATCH(INDEX(INDIRECT($B$5&\"_key\"),MATCH(G$13,INDIRECT($B$5&\"_key[RAMM field name]\"),0),1),INDIRECT($B$5&\"_\"&$C$5&\"[#Headers]\"),0))),\nIF(INDEX(INDIRECT($B$5&\"_key\"),MATCH(G$13,INDIRECT($B$5&\"_key[RAMM field name]\"),0),6)=\"Y\",\"\"&INDEX(INDIRECT($B$5&\"_key\"),MATCH(G$13,INDIRECT($B$5&\"_key[RAMM field name]\"),0),7),\"\"),\nIF(INDEX(INDIRECT($B$5&\"_key\"),MATCH(G$13,INDIRECT($B$5&\"_key[RAMM field name]\"),0),3)=\"lookup\",\nINDEX(INDIRECT(INDEX(INDIRECT($B$5&\"_key\"),MATCH(G$13,INDIRECT($B$5&\"_key[RAMM field name]\"),0),4)),\nMATCH(INDEX(INDIRECT($B$5&\"_\"&$C$5),ROW()-13,MATCH(INDEX(INDIRECT($B$5&\"_key\"),MATCH(G$13,INDIRECT($B$5&\"_key[RAMM field name]\"),0),1),INDIRECT($B$5&\"_\"&$C$5&\"[#Headers]\"),0)),\nINDIRECT(INDEX(INDIRECT($B$5&\"_key\"),MATCH(G$13,INDIRECT($B$5&\"_key[RAMM field name]\"),0),4)&\"[\"&INDEX(INDIRECT($B$5&\"_key\"),MATCH(G$13,INDIRECT($B$5&\"_key[RAMM field name]\"),0),2)&\"]\"),0),1),\nINDEX(INDIRECT($B$5&\"_\"&$C$5),ROW()-13,MATCH(INDEX(INDIRECT($B$5&\"_key\"),MATCH(G$13,INDIRECT($B$5&\"_key[RAMM field name]\"),0),1),INDIRECT($B$5&\"_\"&$C$5&\"[#Headers]\"),0))))","v":{"$error":"#N/A"}},{"$f":"IF(ISBLANK(INDEX(INDIRECT($B$5&\"_\"&$C$5),ROW()-13,MATCH(INDEX(INDIRECT($B$5&\"_key\"),MATCH(H$13,INDIRECT($B$5&\"_key[RAMM field name]\"),0),1),INDIRECT($B$5&\"_\"&$C$5&\"[#Headers]\"),0))),\nIF(INDEX(INDIRECT($B$5&\"_key\"),MATCH(H$13,INDIRECT($B$5&\"_key[RAMM field name]\"),0),6)=\"Y\",\"\"&INDEX(INDIRECT($B$5&\"_key\"),MATCH(H$13,INDIRECT($B$5&\"_key[RAMM field name]\"),0),7),\"\"),\nIF(INDEX(INDIRECT($B$5&\"_key\"),MATCH(H$13,INDIRECT($B$5&\"_key[RAMM field name]\"),0),3)=\"lookup\",\nINDEX(INDIRECT(INDEX(INDIRECT($B$5&\"_key\"),MATCH(H$13,INDIRECT($B$5&\"_key[RAMM field name]\"),0),4)),\nMATCH(INDEX(INDIRECT($B$5&\"_\"&$C$5),ROW()-13,MATCH(INDEX(INDIRECT($B$5&\"_key\"),MATCH(H$13,INDIRECT($B$5&\"_key[RAMM field name]\"),0),1),INDIRECT($B$5&\"_\"&$C$5&\"[#Headers]\"),0)),\nINDIRECT(INDEX(INDIRECT($B$5&\"_key\"),MATCH(H$13,INDIRECT($B$5&\"_key[RAMM field name]\"),0),4)&\"[\"&INDEX(INDIRECT($B$5&\"_key\"),MATCH(H$13,INDIRECT($B$5&\"_key[RAMM field name]\"),0),2)&\"]\"),0),1),\nINDEX(INDIRECT($B$5&\"_\"&$C$5),ROW()-13,MATCH(INDEX(INDIRECT($B$5&\"_key\"),MATCH(H$13,INDIRECT($B$5&\"_key[RAMM field name]\"),0),1),INDIRECT($B$5&\"_\"&$C$5&\"[#Headers]\"),0))))","v":{"$error":"#N/A"}},{"$f":"IF(ISBLANK(INDEX(INDIRECT($B$5&\"_\"&$C$5),ROW()-13,MATCH(INDEX(INDIRECT($B$5&\"_key\"),MATCH(I$13,INDIRECT($B$5&\"_key[RAMM field name]\"),0),1),INDIRECT($B$5&\"_\"&$C$5&\"[#Headers]\"),0))),\nIF(INDEX(INDIRECT($B$5&\"_key\"),MATCH(I$13,INDIRECT($B$5&\"_key[RAMM field name]\"),0),6)=\"Y\",\"\"&INDEX(INDIRECT($B$5&\"_key\"),MATCH(I$13,INDIRECT($B$5&\"_key[RAMM field name]\"),0),7),\"\"),\nIF(INDEX(INDIRECT($B$5&\"_key\"),MATCH(I$13,INDIRECT($B$5&\"_key[RAMM field name]\"),0),3)=\"lookup\",\nINDEX(INDIRECT(INDEX(INDIRECT($B$5&\"_key\"),MATCH(I$13,INDIRECT($B$5&\"_key[RAMM field name]\"),0),4)),\nMATCH(INDEX(INDIRECT($B$5&\"_\"&$C$5),ROW()-13,MATCH(INDEX(INDIRECT($B$5&\"_key\"),MATCH(I$13,INDIRECT($B$5&\"_key[RAMM field name]\"),0),1),INDIRECT($B$5&\"_\"&$C$5&\"[#Headers]\"),0)),\nINDIRECT(INDEX(INDIRECT($B$5&\"_key\"),MATCH(I$13,INDIRECT($B$5&\"_key[RAMM field name]\"),0),4)&\"[\"&INDEX(INDIRECT($B$5&\"_key\"),MATCH(I$13,INDIRECT($B$5&\"_key[RAMM field name]\"),0),2)&\"]\"),0),1),\nINDEX(INDIRECT($B$5&\"_\"&$C$5),ROW()-13,MATCH(INDEX(INDIRECT($B$5&\"_key\"),MATCH(I$13,INDIRECT($B$5&\"_key[RAMM field name]\"),0),1),INDIRECT($B$5&\"_\"&$C$5&\"[#Headers]\"),0))))","v":{"$error":"#N/A"}},{"$f":"IF(ISBLANK(INDEX(INDIRECT($B$5&\"_\"&$C$5),ROW()-13,MATCH(INDEX(INDIRECT($B$5&\"_key\"),MATCH(J$13,INDIRECT($B$5&\"_key[RAMM field name]\"),0),1),INDIRECT($B$5&\"_\"&$C$5&\"[#Headers]\"),0))),\nIF(INDEX(INDIRECT($B$5&\"_key\"),MATCH(J$13,INDIRECT($B$5&\"_key[RAMM field name]\"),0),6)=\"Y\",\"\"&INDEX(INDIRECT($B$5&\"_key\"),MATCH(J$13,INDIRECT($B$5&\"_key[RAMM field name]\"),0),7),\"\"),\nIF(INDEX(INDIRECT($B$5&\"_key\"),MATCH(J$13,INDIRECT($B$5&\"_key[RAMM field name]\"),0),3)=\"lookup\",\nINDEX(INDIRECT(INDEX(INDIRECT($B$5&\"_key\"),MATCH(J$13,INDIRECT($B$5&\"_key[RAMM field name]\"),0),4)),\nMATCH(INDEX(INDIRECT($B$5&\"_\"&$C$5),ROW()-13,MATCH(INDEX(INDIRECT($B$5&\"_key\"),MATCH(J$13,INDIRECT($B$5&\"_key[RAMM field name]\"),0),1),INDIRECT($B$5&\"_\"&$C$5&\"[#Headers]\"),0)),\nINDIRECT(INDEX(INDIRECT($B$5&\"_key\"),MATCH(J$13,INDIRECT($B$5&\"_key[RAMM field name]\"),0),4)&\"[\"&INDEX(INDIRECT($B$5&\"_key\"),MATCH(J$13,INDIRECT($B$5&\"_key[RAMM field name]\"),0),2)&\"]\"),0),1),\nINDEX(INDIRECT($B$5&\"_\"&$C$5),ROW()-13,MATCH(INDEX(INDIRECT($B$5&\"_key\"),MATCH(J$13,INDIRECT($B$5&\"_key[RAMM field name]\"),0),1),INDIRECT($B$5&\"_\"&$C$5&\"[#Headers]\"),0))))","v":{"$error":"#N/A"}},{"$f":"IF(ISBLANK(INDEX(INDIRECT($B$5&\"_\"&$C$5),ROW()-13,MATCH(INDEX(INDIRECT($B$5&\"_key\"),MATCH(K$13,INDIRECT($B$5&\"_key[RAMM field name]\"),0),1),INDIRECT($B$5&\"_\"&$C$5&\"[#Headers]\"),0))),\nIF(INDEX(INDIRECT($B$5&\"_key\"),MATCH(K$13,INDIRECT($B$5&\"_key[RAMM field name]\"),0),6)=\"Y\",\"\"&INDEX(INDIRECT($B$5&\"_key\"),MATCH(K$13,INDIRECT($B$5&\"_key[RAMM field name]\"),0),7),\"\"),\nIF(INDEX(INDIRECT($B$5&\"_key\"),MATCH(K$13,INDIRECT($B$5&\"_key[RAMM field name]\"),0),3)=\"lookup\",\nINDEX(INDIRECT(INDEX(INDIRECT($B$5&\"_key\"),MATCH(K$13,INDIRECT($B$5&\"_key[RAMM field name]\"),0),4)),\nMATCH(INDEX(INDIRECT($B$5&\"_\"&$C$5),ROW()-13,MATCH(INDEX(INDIRECT($B$5&\"_key\"),MATCH(K$13,INDIRECT($B$5&\"_key[RAMM field name]\"),0),1),INDIRECT($B$5&\"_\"&$C$5&\"[#Headers]\"),0)),\nINDIRECT(INDEX(INDIRECT($B$5&\"_key\"),MATCH(K$13,INDIRECT($B$5&\"_key[RAMM field name]\"),0),4)&\"[\"&INDEX(INDIRECT($B$5&\"_key\"),MATCH(K$13,INDIRECT($B$5&\"_key[RAMM field name]\"),0),2)&\"]\"),0),1),\nINDEX(INDIRECT($B$5&\"_\"&$C$5),ROW()-13,MATCH(INDEX(INDIRECT($B$5&\"_key\"),MATCH(K$13,INDIRECT($B$5&\"_key[RAMM field name]\"),0),1),INDIRECT($B$5&\"_\"&$C$5&\"[#Headers]\"),0))))","v":{"$error":"#N/A"}},{"$f":"IF(ISBLANK(INDEX(INDIRECT($B$5&\"_\"&$C$5),ROW()-13,MATCH(INDEX(INDIRECT($B$5&\"_key\"),MATCH(L$13,INDIRECT($B$5&\"_key[RAMM field name]\"),0),1),INDIRECT($B$5&\"_\"&$C$5&\"[#Headers]\"),0))),\nIF(INDEX(INDIRECT($B$5&\"_key\"),MATCH(L$13,INDIRECT($B$5&\"_key[RAMM field name]\"),0),6)=\"Y\",\"\"&INDEX(INDIRECT($B$5&\"_key\"),MATCH(L$13,INDIRECT($B$5&\"_key[RAMM field name]\"),0),7),\"\"),\nIF(INDEX(INDIRECT($B$5&\"_key\"),MATCH(L$13,INDIRECT($B$5&\"_key[RAMM field name]\"),0),3)=\"lookup\",\nINDEX(INDIRECT(INDEX(INDIRECT($B$5&\"_key\"),MATCH(L$13,INDIRECT($B$5&\"_key[RAMM field name]\"),0),4)),\nMATCH(INDEX(INDIRECT($B$5&\"_\"&$C$5),ROW()-13,MATCH(INDEX(INDIRECT($B$5&\"_key\"),MATCH(L$13,INDIRECT($B$5&\"_key[RAMM field name]\"),0),1),INDIRECT($B$5&\"_\"&$C$5&\"[#Headers]\"),0)),\nINDIRECT(INDEX(INDIRECT($B$5&\"_key\"),MATCH(L$13,INDIRECT($B$5&\"_key[RAMM field name]\"),0),4)&\"[\"&INDEX(INDIRECT($B$5&\"_key\"),MATCH(L$13,INDIRECT($B$5&\"_key[RAMM field name]\"),0),2)&\"]\"),0),1),\nINDEX(INDIRECT($B$5&\"_\"&$C$5),ROW()-13,MATCH(INDEX(INDIRECT($B$5&\"_key\"),MATCH(L$13,INDIRECT($B$5&\"_key[RAMM field name]\"),0),1),INDIRECT($B$5&\"_\"&$C$5&\"[#Headers]\"),0))))","v":{"$error":"#N/A"}},{"$f":"IF(ISBLANK(INDEX(INDIRECT($B$5&\"_\"&$C$5),ROW()-13,MATCH(INDEX(INDIRECT($B$5&\"_key\"),MATCH(M$13,INDIRECT($B$5&\"_key[RAMM field name]\"),0),1),INDIRECT($B$5&\"_\"&$C$5&\"[#Headers]\"),0))),\nIF(INDEX(INDIRECT($B$5&\"_key\"),MATCH(M$13,INDIRECT($B$5&\"_key[RAMM field name]\"),0),6)=\"Y\",\"\"&INDEX(INDIRECT($B$5&\"_key\"),MATCH(M$13,INDIRECT($B$5&\"_key[RAMM field name]\"),0),7),\"\"),\nIF(INDEX(INDIRECT($B$5&\"_key\"),MATCH(M$13,INDIRECT($B$5&\"_key[RAMM field name]\"),0),3)=\"lookup\",\nINDEX(INDIRECT(INDEX(INDIRECT($B$5&\"_key\"),MATCH(M$13,INDIRECT($B$5&\"_key[RAMM field name]\"),0),4)),\nMATCH(INDEX(INDIRECT($B$5&\"_\"&$C$5),ROW()-13,MATCH(INDEX(INDIRECT($B$5&\"_key\"),MATCH(M$13,INDIRECT($B$5&\"_key[RAMM field name]\"),0),1),INDIRECT($B$5&\"_\"&$C$5&\"[#Headers]\"),0)),\nINDIRECT(INDEX(INDIRECT($B$5&\"_key\"),MATCH(M$13,INDIRECT($B$5&\"_key[RAMM field name]\"),0),4)&\"[\"&INDEX(INDIRECT($B$5&\"_key\"),MATCH(M$13,INDIRECT($B$5&\"_key[RAMM field name]\"),0),2)&\"]\"),0),1),\nINDEX(INDIRECT($B$5&\"_\"&$C$5),ROW()-13,MATCH(INDEX(INDIRECT($B$5&\"_key\"),MATCH(M$13,INDIRECT($B$5&\"_key[RAMM field name]\"),0),1),INDIRECT($B$5&\"_\"&$C$5&\"[#Headers]\"),0))))","v":{"$error":"#N/A"}},{"$f":"IF(ISBLANK(INDEX(INDIRECT($B$5&\"_\"&$C$5),ROW()-13,MATCH(INDEX(INDIRECT($B$5&\"_key\"),MATCH(N$13,INDIRECT($B$5&\"_key[RAMM field name]\"),0),1),INDIRECT($B$5&\"_\"&$C$5&\"[#Headers]\"),0))),\nIF(INDEX(INDIRECT($B$5&\"_key\"),MATCH(N$13,INDIRECT($B$5&\"_key[RAMM field name]\"),0),6)=\"Y\",\"\"&INDEX(INDIRECT($B$5&\"_key\"),MATCH(N$13,INDIRECT($B$5&\"_key[RAMM field name]\"),0),7),\"\"),\nIF(INDEX(INDIRECT($B$5&\"_key\"),MATCH(N$13,INDIRECT($B$5&\"_key[RAMM field name]\"),0),3)=\"lookup\",\nINDEX(INDIRECT(INDEX(INDIRECT($B$5&\"_key\"),MATCH(N$13,INDIRECT($B$5&\"_key[RAMM field name]\"),0),4)),\nMATCH(INDEX(INDIRECT($B$5&\"_\"&$C$5),ROW()-13,MATCH(INDEX(INDIRECT($B$5&\"_key\"),MATCH(N$13,INDIRECT($B$5&\"_key[RAMM field name]\"),0),1),INDIRECT($B$5&\"_\"&$C$5&\"[#Headers]\"),0)),\nINDIRECT(INDEX(INDIRECT($B$5&\"_key\"),MATCH(N$13,INDIRECT($B$5&\"_key[RAMM field name]\"),0),4)&\"[\"&INDEX(INDIRECT($B$5&\"_key\"),MATCH(N$13,INDIRECT($B$5&\"_key[RAMM field name]\"),0),2)&\"]\"),0),1),\nINDEX(INDIRECT($B$5&\"_\"&$C$5),ROW()-13,MATCH(INDEX(INDIRECT($B$5&\"_key\"),MATCH(N$13,INDIRECT($B$5&\"_key[RAMM field name]\"),0),1),INDIRECT($B$5&\"_\"&$C$5&\"[#Headers]\"),0))))","v":{"$error":"#N/A"}},{"$f":"IF(ISBLANK(INDEX(INDIRECT($B$5&\"_\"&$C$5),ROW()-13,MATCH(INDEX(INDIRECT($B$5&\"_key\"),MATCH(O$13,INDIRECT($B$5&\"_key[RAMM field name]\"),0),1),INDIRECT($B$5&\"_\"&$C$5&\"[#Headers]\"),0))),\nIF(INDEX(INDIRECT($B$5&\"_key\"),MATCH(O$13,INDIRECT($B$5&\"_key[RAMM field name]\"),0),6)=\"Y\",\"\"&INDEX(INDIRECT($B$5&\"_key\"),MATCH(O$13,INDIRECT($B$5&\"_key[RAMM field name]\"),0),7),\"\"),\nIF(INDEX(INDIRECT($B$5&\"_key\"),MATCH(O$13,INDIRECT($B$5&\"_key[RAMM field name]\"),0),3)=\"lookup\",\nINDEX(INDIRECT(INDEX(INDIRECT($B$5&\"_key\"),MATCH(O$13,INDIRECT($B$5&\"_key[RAMM field name]\"),0),4)),\nMATCH(INDEX(INDIRECT($B$5&\"_\"&$C$5),ROW()-13,MATCH(INDEX(INDIRECT($B$5&\"_key\"),MATCH(O$13,INDIRECT($B$5&\"_key[RAMM field name]\"),0),1),INDIRECT($B$5&\"_\"&$C$5&\"[#Headers]\"),0)),\nINDIRECT(INDEX(INDIRECT($B$5&\"_key\"),MATCH(O$13,INDIRECT($B$5&\"_key[RAMM field name]\"),0),4)&\"[\"&INDEX(INDIRECT($B$5&\"_key\"),MATCH(O$13,INDIRECT($B$5&\"_key[RAMM field name]\"),0),2)&\"]\"),0),1),\nINDEX(INDIRECT($B$5&\"_\"&$C$5),ROW()-13,MATCH(INDEX(INDIRECT($B$5&\"_key\"),MATCH(O$13,INDIRECT($B$5&\"_key[RAMM field name]\"),0),1),INDIRECT($B$5&\"_\"&$C$5&\"[#Headers]\"),0))))","v":{"$error":"#N/A"}},{"$f":"IF(ISBLANK(INDEX(INDIRECT($B$5&\"_\"&$C$5),ROW()-13,MATCH(INDEX(INDIRECT($B$5&\"_key\"),MATCH(P$13,INDIRECT($B$5&\"_key[RAMM field name]\"),0),1),INDIRECT($B$5&\"_\"&$C$5&\"[#Headers]\"),0))),\nIF(INDEX(INDIRECT($B$5&\"_key\"),MATCH(P$13,INDIRECT($B$5&\"_key[RAMM field name]\"),0),6)=\"Y\",\"\"&INDEX(INDIRECT($B$5&\"_key\"),MATCH(P$13,INDIRECT($B$5&\"_key[RAMM field name]\"),0),7),\"\"),\nIF(INDEX(INDIRECT($B$5&\"_key\"),MATCH(P$13,INDIRECT($B$5&\"_key[RAMM field name]\"),0),3)=\"lookup\",\nINDEX(INDIRECT(INDEX(INDIRECT($B$5&\"_key\"),MATCH(P$13,INDIRECT($B$5&\"_key[RAMM field name]\"),0),4)),\nMATCH(INDEX(INDIRECT($B$5&\"_\"&$C$5),ROW()-13,MATCH(INDEX(INDIRECT($B$5&\"_key\"),MATCH(P$13,INDIRECT($B$5&\"_key[RAMM field name]\"),0),1),INDIRECT($B$5&\"_\"&$C$5&\"[#Headers]\"),0)),\nINDIRECT(INDEX(INDIRECT($B$5&\"_key\"),MATCH(P$13,INDIRECT($B$5&\"_key[RAMM field name]\"),0),4)&\"[\"&INDEX(INDIRECT($B$5&\"_key\"),MATCH(P$13,INDIRECT($B$5&\"_key[RAMM field name]\"),0),2)&\"]\"),0),1),\nINDEX(INDIRECT($B$5&\"_\"&$C$5),ROW()-13,MATCH(INDEX(INDIRECT($B$5&\"_key\"),MATCH(P$13,INDIRECT($B$5&\"_key[RAMM field name]\"),0),1),INDIRECT($B$5&\"_\"&$C$5&\"[#Headers]\"),0))))","v":{"$error":"#N/A"}},{"$f":"IF(ISBLANK(INDEX(INDIRECT($B$5&\"_\"&$C$5),ROW()-13,MATCH(INDEX(INDIRECT($B$5&\"_key\"),MATCH(Q$13,INDIRECT($B$5&\"_key[RAMM field name]\"),0),1),INDIRECT($B$5&\"_\"&$C$5&\"[#Headers]\"),0))),\nIF(INDEX(INDIRECT($B$5&\"_key\"),MATCH(Q$13,INDIRECT($B$5&\"_key[RAMM field name]\"),0),6)=\"Y\",\"\"&INDEX(INDIRECT($B$5&\"_key\"),MATCH(Q$13,INDIRECT($B$5&\"_key[RAMM field name]\"),0),7),\"\"),\nIF(INDEX(INDIRECT($B$5&\"_key\"),MATCH(Q$13,INDIRECT($B$5&\"_key[RAMM field name]\"),0),3)=\"lookup\",\nINDEX(INDIRECT(INDEX(INDIRECT($B$5&\"_key\"),MATCH(Q$13,INDIRECT($B$5&\"_key[RAMM field name]\"),0),4)),\nMATCH(INDEX(INDIRECT($B$5&\"_\"&$C$5),ROW()-13,MATCH(INDEX(INDIRECT($B$5&\"_key\"),MATCH(Q$13,INDIRECT($B$5&\"_key[RAMM field name]\"),0),1),INDIRECT($B$5&\"_\"&$C$5&\"[#Headers]\"),0)),\nINDIRECT(INDEX(INDIRECT($B$5&\"_key\"),MATCH(Q$13,INDIRECT($B$5&\"_key[RAMM field name]\"),0),4)&\"[\"&INDEX(INDIRECT($B$5&\"_key\"),MATCH(Q$13,INDIRECT($B$5&\"_key[RAMM field name]\"),0),2)&\"]\"),0),1),\nINDEX(INDIRECT($B$5&\"_\"&$C$5),ROW()-13,MATCH(INDEX(INDIRECT($B$5&\"_key\"),MATCH(Q$13,INDIRECT($B$5&\"_key[RAMM field name]\"),0),1),INDIRECT($B$5&\"_\"&$C$5&\"[#Headers]\"),0))))","v":{"$error":"#N/A"}},{"$f":"IF(ISBLANK(INDEX(INDIRECT($B$5&\"_\"&$C$5),ROW()-13,MATCH(INDEX(INDIRECT($B$5&\"_key\"),MATCH(R$13,INDIRECT($B$5&\"_key[RAMM field name]\"),0),1),INDIRECT($B$5&\"_\"&$C$5&\"[#Headers]\"),0))),\nIF(INDEX(INDIRECT($B$5&\"_key\"),MATCH(R$13,INDIRECT($B$5&\"_key[RAMM field name]\"),0),6)=\"Y\",\"\"&INDEX(INDIRECT($B$5&\"_key\"),MATCH(R$13,INDIRECT($B$5&\"_key[RAMM field name]\"),0),7),\"\"),\nIF(INDEX(INDIRECT($B$5&\"_key\"),MATCH(R$13,INDIRECT($B$5&\"_key[RAMM field name]\"),0),3)=\"lookup\",\nINDEX(INDIRECT(INDEX(INDIRECT($B$5&\"_key\"),MATCH(R$13,INDIRECT($B$5&\"_key[RAMM field name]\"),0),4)),\nMATCH(INDEX(INDIRECT($B$5&\"_\"&$C$5),ROW()-13,MATCH(INDEX(INDIRECT($B$5&\"_key\"),MATCH(R$13,INDIRECT($B$5&\"_key[RAMM field name]\"),0),1),INDIRECT($B$5&\"_\"&$C$5&\"[#Headers]\"),0)),\nINDIRECT(INDEX(INDIRECT($B$5&\"_key\"),MATCH(R$13,INDIRECT($B$5&\"_key[RAMM field name]\"),0),4)&\"[\"&INDEX(INDIRECT($B$5&\"_key\"),MATCH(R$13,INDIRECT($B$5&\"_key[RAMM field name]\"),0),2)&\"]\"),0),1),\nINDEX(INDIRECT($B$5&\"_\"&$C$5),ROW()-13,MATCH(INDEX(INDIRECT($B$5&\"_key\"),MATCH(R$13,INDIRECT($B$5&\"_key[RAMM field name]\"),0),1),INDIRECT($B$5&\"_\"&$C$5&\"[#Headers]\"),0))))","v":{"$error":"#N/A"}},{"$f":"IF(ISBLANK(INDEX(INDIRECT($B$5&\"_\"&$C$5),ROW()-13,MATCH(INDEX(INDIRECT($B$5&\"_key\"),MATCH(S$13,INDIRECT($B$5&\"_key[RAMM field name]\"),0),1),INDIRECT($B$5&\"_\"&$C$5&\"[#Headers]\"),0))),\nIF(INDEX(INDIRECT($B$5&\"_key\"),MATCH(S$13,INDIRECT($B$5&\"_key[RAMM field name]\"),0),6)=\"Y\",\"\"&INDEX(INDIRECT($B$5&\"_key\"),MATCH(S$13,INDIRECT($B$5&\"_key[RAMM field name]\"),0),7),\"\"),\nIF(INDEX(INDIRECT($B$5&\"_key\"),MATCH(S$13,INDIRECT($B$5&\"_key[RAMM field name]\"),0),3)=\"lookup\",\nINDEX(INDIRECT(INDEX(INDIRECT($B$5&\"_key\"),MATCH(S$13,INDIRECT($B$5&\"_key[RAMM field name]\"),0),4)),\nMATCH(INDEX(INDIRECT($B$5&\"_\"&$C$5),ROW()-13,MATCH(INDEX(INDIRECT($B$5&\"_key\"),MATCH(S$13,INDIRECT($B$5&\"_key[RAMM field name]\"),0),1),INDIRECT($B$5&\"_\"&$C$5&\"[#Headers]\"),0)),\nINDIRECT(INDEX(INDIRECT($B$5&\"_key\"),MATCH(S$13,INDIRECT($B$5&\"_key[RAMM field name]\"),0),4)&\"[\"&INDEX(INDIRECT($B$5&\"_key\"),MATCH(S$13,INDIRECT($B$5&\"_key[RAMM field name]\"),0),2)&\"]\"),0),1),\nINDEX(INDIRECT($B$5&\"_\"&$C$5),ROW()-13,MATCH(INDEX(INDIRECT($B$5&\"_key\"),MATCH(S$13,INDIRECT($B$5&\"_key[RAMM field name]\"),0),1),INDIRECT($B$5&\"_\"&$C$5&\"[#Headers]\"),0))))","v":{"$error":"#N/A"}},{"$f":"IF(ISBLANK(INDEX(INDIRECT($B$5&\"_\"&$C$5),ROW()-13,MATCH(INDEX(INDIRECT($B$5&\"_key\"),MATCH(T$13,INDIRECT($B$5&\"_key[RAMM field name]\"),0),1),INDIRECT($B$5&\"_\"&$C$5&\"[#Headers]\"),0))),\nIF(INDEX(INDIRECT($B$5&\"_key\"),MATCH(T$13,INDIRECT($B$5&\"_key[RAMM field name]\"),0),6)=\"Y\",\"\"&INDEX(INDIRECT($B$5&\"_key\"),MATCH(T$13,INDIRECT($B$5&\"_key[RAMM field name]\"),0),7),\"\"),\nIF(INDEX(INDIRECT($B$5&\"_key\"),MATCH(T$13,INDIRECT($B$5&\"_key[RAMM field name]\"),0),3)=\"lookup\",\nINDEX(INDIRECT(INDEX(INDIRECT($B$5&\"_key\"),MATCH(T$13,INDIRECT($B$5&\"_key[RAMM field name]\"),0),4)),\nMATCH(INDEX(INDIRECT($B$5&\"_\"&$C$5),ROW()-13,MATCH(INDEX(INDIRECT($B$5&\"_key\"),MATCH(T$13,INDIRECT($B$5&\"_key[RAMM field name]\"),0),1),INDIRECT($B$5&\"_\"&$C$5&\"[#Headers]\"),0)),\nINDIRECT(INDEX(INDIRECT($B$5&\"_key\"),MATCH(T$13,INDIRECT($B$5&\"_key[RAMM field name]\"),0),4)&\"[\"&INDEX(INDIRECT($B$5&\"_key\"),MATCH(T$13,INDIRECT($B$5&\"_key[RAMM field name]\"),0),2)&\"]\"),0),1),\nINDEX(INDIRECT($B$5&\"_\"&$C$5),ROW()-13,MATCH(INDEX(INDIRECT($B$5&\"_key\"),MATCH(T$13,INDIRECT($B$5&\"_key[RAMM field name]\"),0),1),INDIRECT($B$5&\"_\"&$C$5&\"[#Headers]\"),0))))","v":{"$error":"#N/A"}},{"$f":"IF(ISBLANK(INDEX(INDIRECT($B$5&\"_\"&$C$5),ROW()-13,MATCH(INDEX(INDIRECT($B$5&\"_key\"),MATCH(U$13,INDIRECT($B$5&\"_key[RAMM field name]\"),0),1),INDIRECT($B$5&\"_\"&$C$5&\"[#Headers]\"),0))),\nIF(INDEX(INDIRECT($B$5&\"_key\"),MATCH(U$13,INDIRECT($B$5&\"_key[RAMM field name]\"),0),6)=\"Y\",\"\"&INDEX(INDIRECT($B$5&\"_key\"),MATCH(U$13,INDIRECT($B$5&\"_key[RAMM field name]\"),0),7),\"\"),\nIF(INDEX(INDIRECT($B$5&\"_key\"),MATCH(U$13,INDIRECT($B$5&\"_key[RAMM field name]\"),0),3)=\"lookup\",\nINDEX(INDIRECT(INDEX(INDIRECT($B$5&\"_key\"),MATCH(U$13,INDIRECT($B$5&\"_key[RAMM field name]\"),0),4)),\nMATCH(INDEX(INDIRECT($B$5&\"_\"&$C$5),ROW()-13,MATCH(INDEX(INDIRECT($B$5&\"_key\"),MATCH(U$13,INDIRECT($B$5&\"_key[RAMM field name]\"),0),1),INDIRECT($B$5&\"_\"&$C$5&\"[#Headers]\"),0)),\nINDIRECT(INDEX(INDIRECT($B$5&\"_key\"),MATCH(U$13,INDIRECT($B$5&\"_key[RAMM field name]\"),0),4)&\"[\"&INDEX(INDIRECT($B$5&\"_key\"),MATCH(U$13,INDIRECT($B$5&\"_key[RAMM field name]\"),0),2)&\"]\"),0),1),\nINDEX(INDIRECT($B$5&\"_\"&$C$5),ROW()-13,MATCH(INDEX(INDIRECT($B$5&\"_key\"),MATCH(U$13,INDIRECT($B$5&\"_key[RAMM field name]\"),0),1),INDIRECT($B$5&\"_\"&$C$5&\"[#Headers]\"),0))))","v":{"$error":"#N/A"}},{"$f":"IF(ISBLANK(INDEX(INDIRECT($B$5&\"_\"&$C$5),ROW()-13,MATCH(INDEX(INDIRECT($B$5&\"_key\"),MATCH(V$13,INDIRECT($B$5&\"_key[RAMM field name]\"),0),1),INDIRECT($B$5&\"_\"&$C$5&\"[#Headers]\"),0))),\nIF(INDEX(INDIRECT($B$5&\"_key\"),MATCH(V$13,INDIRECT($B$5&\"_key[RAMM field name]\"),0),6)=\"Y\",\"\"&INDEX(INDIRECT($B$5&\"_key\"),MATCH(V$13,INDIRECT($B$5&\"_key[RAMM field name]\"),0),7),\"\"),\nIF(INDEX(INDIRECT($B$5&\"_key\"),MATCH(V$13,INDIRECT($B$5&\"_key[RAMM field name]\"),0),3)=\"lookup\",\nINDEX(INDIRECT(INDEX(INDIRECT($B$5&\"_key\"),MATCH(V$13,INDIRECT($B$5&\"_key[RAMM field name]\"),0),4)),\nMATCH(INDEX(INDIRECT($B$5&\"_\"&$C$5),ROW()-13,MATCH(INDEX(INDIRECT($B$5&\"_key\"),MATCH(V$13,INDIRECT($B$5&\"_key[RAMM field name]\"),0),1),INDIRECT($B$5&\"_\"&$C$5&\"[#Headers]\"),0)),\nINDIRECT(INDEX(INDIRECT($B$5&\"_key\"),MATCH(V$13,INDIRECT($B$5&\"_key[RAMM field name]\"),0),4)&\"[\"&INDEX(INDIRECT($B$5&\"_key\"),MATCH(V$13,INDIRECT($B$5&\"_key[RAMM field name]\"),0),2)&\"]\"),0),1),\nINDEX(INDIRECT($B$5&\"_\"&$C$5),ROW()-13,MATCH(INDEX(INDIRECT($B$5&\"_key\"),MATCH(V$13,INDIRECT($B$5&\"_key[RAMM field name]\"),0),1),INDIRECT($B$5&\"_\"&$C$5&\"[#Headers]\"),0))))","v":{"$error":"#N/A"}},{"$f":"IF(ISBLANK(INDEX(INDIRECT($B$5&\"_\"&$C$5),ROW()-13,MATCH(INDEX(INDIRECT($B$5&\"_key\"),MATCH(W$13,INDIRECT($B$5&\"_key[RAMM field name]\"),0),1),INDIRECT($B$5&\"_\"&$C$5&\"[#Headers]\"),0))),\nIF(INDEX(INDIRECT($B$5&\"_key\"),MATCH(W$13,INDIRECT($B$5&\"_key[RAMM field name]\"),0),6)=\"Y\",\"\"&INDEX(INDIRECT($B$5&\"_key\"),MATCH(W$13,INDIRECT($B$5&\"_key[RAMM field name]\"),0),7),\"\"),\nIF(INDEX(INDIRECT($B$5&\"_key\"),MATCH(W$13,INDIRECT($B$5&\"_key[RAMM field name]\"),0),3)=\"lookup\",\nINDEX(INDIRECT(INDEX(INDIRECT($B$5&\"_key\"),MATCH(W$13,INDIRECT($B$5&\"_key[RAMM field name]\"),0),4)),\nMATCH(INDEX(INDIRECT($B$5&\"_\"&$C$5),ROW()-13,MATCH(INDEX(INDIRECT($B$5&\"_key\"),MATCH(W$13,INDIRECT($B$5&\"_key[RAMM field name]\"),0),1),INDIRECT($B$5&\"_\"&$C$5&\"[#Headers]\"),0)),\nINDIRECT(INDEX(INDIRECT($B$5&\"_key\"),MATCH(W$13,INDIRECT($B$5&\"_key[RAMM field name]\"),0),4)&\"[\"&INDEX(INDIRECT($B$5&\"_key\"),MATCH(W$13,INDIRECT($B$5&\"_key[RAMM field name]\"),0),2)&\"]\"),0),1),\nINDEX(INDIRECT($B$5&\"_\"&$C$5),ROW()-13,MATCH(INDEX(INDIRECT($B$5&\"_key\"),MATCH(W$13,INDIRECT($B$5&\"_key[RAMM field name]\"),0),1),INDIRECT($B$5&\"_\"&$C$5&\"[#Headers]\"),0))))","v":{"$error":"#N/A"}},{"$f":"IF(ISBLANK(INDEX(INDIRECT($B$5&\"_\"&$C$5),ROW()-13,MATCH(INDEX(INDIRECT($B$5&\"_key\"),MATCH(X$13,INDIRECT($B$5&\"_key[RAMM field name]\"),0),1),INDIRECT($B$5&\"_\"&$C$5&\"[#Headers]\"),0))),\nIF(INDEX(INDIRECT($B$5&\"_key\"),MATCH(X$13,INDIRECT($B$5&\"_key[RAMM field name]\"),0),6)=\"Y\",\"\"&INDEX(INDIRECT($B$5&\"_key\"),MATCH(X$13,INDIRECT($B$5&\"_key[RAMM field name]\"),0),7),\"\"),\nIF(INDEX(INDIRECT($B$5&\"_key\"),MATCH(X$13,INDIRECT($B$5&\"_key[RAMM field name]\"),0),3)=\"lookup\",\nINDEX(INDIRECT(INDEX(INDIRECT($B$5&\"_key\"),MATCH(X$13,INDIRECT($B$5&\"_key[RAMM field name]\"),0),4)),\nMATCH(INDEX(INDIRECT($B$5&\"_\"&$C$5),ROW()-13,MATCH(INDEX(INDIRECT($B$5&\"_key\"),MATCH(X$13,INDIRECT($B$5&\"_key[RAMM field name]\"),0),1),INDIRECT($B$5&\"_\"&$C$5&\"[#Headers]\"),0)),\nINDIRECT(INDEX(INDIRECT($B$5&\"_key\"),MATCH(X$13,INDIRECT($B$5&\"_key[RAMM field name]\"),0),4)&\"[\"&INDEX(INDIRECT($B$5&\"_key\"),MATCH(X$13,INDIRECT($B$5&\"_key[RAMM field name]\"),0),2)&\"]\"),0),1),\nINDEX(INDIRECT($B$5&\"_\"&$C$5),ROW()-13,MATCH(INDEX(INDIRECT($B$5&\"_key\"),MATCH(X$13,INDIRECT($B$5&\"_key[RAMM field name]\"),0),1),INDIRECT($B$5&\"_\"&$C$5&\"[#Headers]\"),0))))","v":{"$error":"#N/A"}},{"$f":"IF(ISBLANK(INDEX(INDIRECT($B$5&\"_\"&$C$5),ROW()-13,MATCH(INDEX(INDIRECT($B$5&\"_key\"),MATCH(Y$13,INDIRECT($B$5&\"_key[RAMM field name]\"),0),1),INDIRECT($B$5&\"_\"&$C$5&\"[#Headers]\"),0))),\nIF(INDEX(INDIRECT($B$5&\"_key\"),MATCH(Y$13,INDIRECT($B$5&\"_key[RAMM field name]\"),0),6)=\"Y\",\"\"&INDEX(INDIRECT($B$5&\"_key\"),MATCH(Y$13,INDIRECT($B$5&\"_key[RAMM field name]\"),0),7),\"\"),\nIF(INDEX(INDIRECT($B$5&\"_key\"),MATCH(Y$13,INDIRECT($B$5&\"_key[RAMM field name]\"),0),3)=\"lookup\",\nINDEX(INDIRECT(INDEX(INDIRECT($B$5&\"_key\"),MATCH(Y$13,INDIRECT($B$5&\"_key[RAMM field name]\"),0),4)),\nMATCH(INDEX(INDIRECT($B$5&\"_\"&$C$5),ROW()-13,MATCH(INDEX(INDIRECT($B$5&\"_key\"),MATCH(Y$13,INDIRECT($B$5&\"_key[RAMM field name]\"),0),1),INDIRECT($B$5&\"_\"&$C$5&\"[#Headers]\"),0)),\nINDIRECT(INDEX(INDIRECT($B$5&\"_key\"),MATCH(Y$13,INDIRECT($B$5&\"_key[RAMM field name]\"),0),4)&\"[\"&INDEX(INDIRECT($B$5&\"_key\"),MATCH(Y$13,INDIRECT($B$5&\"_key[RAMM field name]\"),0),2)&\"]\"),0),1),\nINDEX(INDIRECT($B$5&\"_\"&$C$5),ROW()-13,MATCH(INDEX(INDIRECT($B$5&\"_key\"),MATCH(Y$13,INDIRECT($B$5&\"_key[RAMM field name]\"),0),1),INDIRECT($B$5&\"_\"&$C$5&\"[#Headers]\"),0))))","v":{"$error":"#N/A"}},{"$f":"IF(ISBLANK(INDEX(INDIRECT($B$5&\"_\"&$C$5),ROW()-13,MATCH(INDEX(INDIRECT($B$5&\"_key\"),MATCH(Z$13,INDIRECT($B$5&\"_key[RAMM field name]\"),0),1),INDIRECT($B$5&\"_\"&$C$5&\"[#Headers]\"),0))),\nIF(INDEX(INDIRECT($B$5&\"_key\"),MATCH(Z$13,INDIRECT($B$5&\"_key[RAMM field name]\"),0),6)=\"Y\",\"\"&INDEX(INDIRECT($B$5&\"_key\"),MATCH(Z$13,INDIRECT($B$5&\"_key[RAMM field name]\"),0),7),\"\"),\nIF(INDEX(INDIRECT($B$5&\"_key\"),MATCH(Z$13,INDIRECT($B$5&\"_key[RAMM field name]\"),0),3)=\"lookup\",\nINDEX(INDIRECT(INDEX(INDIRECT($B$5&\"_key\"),MATCH(Z$13,INDIRECT($B$5&\"_key[RAMM field name]\"),0),4)),\nMATCH(INDEX(INDIRECT($B$5&\"_\"&$C$5),ROW()-13,MATCH(INDEX(INDIRECT($B$5&\"_key\"),MATCH(Z$13,INDIRECT($B$5&\"_key[RAMM field name]\"),0),1),INDIRECT($B$5&\"_\"&$C$5&\"[#Headers]\"),0)),\nINDIRECT(INDEX(INDIRECT($B$5&\"_key\"),MATCH(Z$13,INDIRECT($B$5&\"_key[RAMM field name]\"),0),4)&\"[\"&INDEX(INDIRECT($B$5&\"_key\"),MATCH(Z$13,INDIRECT($B$5&\"_key[RAMM field name]\"),0),2)&\"]\"),0),1),\nINDEX(INDIRECT($B$5&\"_\"&$C$5),ROW()-13,MATCH(INDEX(INDIRECT($B$5&\"_key\"),MATCH(Z$13,INDIRECT($B$5&\"_key[RAMM field name]\"),0),1),INDIRECT($B$5&\"_\"&$C$5&\"[#Headers]\"),0))))","v":{"$error":"#N/A"}},{"$f":"IF(ISBLANK(INDEX(INDIRECT($B$5&\"_\"&$C$5),ROW()-13,MATCH(INDEX(INDIRECT($B$5&\"_key\"),MATCH(AA$13,INDIRECT($B$5&\"_key[RAMM field name]\"),0),1),INDIRECT($B$5&\"_\"&$C$5&\"[#Headers]\"),0))),\nIF(INDEX(INDIRECT($B$5&\"_key\"),MATCH(AA$13,INDIRECT($B$5&\"_key[RAMM field name]\"),0),6)=\"Y\",\"\"&INDEX(INDIRECT($B$5&\"_key\"),MATCH(AA$13,INDIRECT($B$5&\"_key[RAMM field name]\"),0),7),\"\"),\nIF(INDEX(INDIRECT($B$5&\"_key\"),MATCH(AA$13,INDIRECT($B$5&\"_key[RAMM field name]\"),0),3)=\"lookup\",\nINDEX(INDIRECT(INDEX(INDIRECT($B$5&\"_key\"),MATCH(AA$13,INDIRECT($B$5&\"_key[RAMM field name]\"),0),4)),\nMATCH(INDEX(INDIRECT($B$5&\"_\"&$C$5),ROW()-13,MATCH(INDEX(INDIRECT($B$5&\"_key\"),MATCH(AA$13,INDIRECT($B$5&\"_key[RAMM field name]\"),0),1),INDIRECT($B$5&\"_\"&$C$5&\"[#Headers]\"),0)),\nINDIRECT(INDEX(INDIRECT($B$5&\"_key\"),MATCH(AA$13,INDIRECT($B$5&\"_key[RAMM field name]\"),0),4)&\"[\"&INDEX(INDIRECT($B$5&\"_key\"),MATCH(AA$13,INDIRECT($B$5&\"_key[RAMM field name]\"),0),2)&\"]\"),0),1),\nINDEX(INDIRECT($B$5&\"_\"&$C$5),ROW()-13,MATCH(INDEX(INDIRECT($B$5&\"_key\"),MATCH(AA$13,INDIRECT($B$5&\"_key[RAMM field name]\"),0),1),INDIRECT($B$5&\"_\"&$C$5&\"[#Headers]\"),0))))","v":{"$error":"#N/A"}},{"$f":"IF(ISBLANK(INDEX(INDIRECT($B$5&\"_\"&$C$5),ROW()-13,MATCH(INDEX(INDIRECT($B$5&\"_key\"),MATCH(AB$13,INDIRECT($B$5&\"_key[RAMM field name]\"),0),1),INDIRECT($B$5&\"_\"&$C$5&\"[#Headers]\"),0))),\nIF(INDEX(INDIRECT($B$5&\"_key\"),MATCH(AB$13,INDIRECT($B$5&\"_key[RAMM field name]\"),0),6)=\"Y\",\"\"&INDEX(INDIRECT($B$5&\"_key\"),MATCH(AB$13,INDIRECT($B$5&\"_key[RAMM field name]\"),0),7),\"\"),\nIF(INDEX(INDIRECT($B$5&\"_key\"),MATCH(AB$13,INDIRECT($B$5&\"_key[RAMM field name]\"),0),3)=\"lookup\",\nINDEX(INDIRECT(INDEX(INDIRECT($B$5&\"_key\"),MATCH(AB$13,INDIRECT($B$5&\"_key[RAMM field name]\"),0),4)),\nMATCH(INDEX(INDIRECT($B$5&\"_\"&$C$5),ROW()-13,MATCH(INDEX(INDIRECT($B$5&\"_key\"),MATCH(AB$13,INDIRECT($B$5&\"_key[RAMM field name]\"),0),1),INDIRECT($B$5&\"_\"&$C$5&\"[#Headers]\"),0)),\nINDIRECT(INDEX(INDIRECT($B$5&\"_key\"),MATCH(AB$13,INDIRECT($B$5&\"_key[RAMM field name]\"),0),4)&\"[\"&INDEX(INDIRECT($B$5&\"_key\"),MATCH(AB$13,INDIRECT($B$5&\"_key[RAMM field name]\"),0),2)&\"]\"),0),1),\nINDEX(INDIRECT($B$5&\"_\"&$C$5),ROW()-13,MATCH(INDEX(INDIRECT($B$5&\"_key\"),MATCH(AB$13,INDIRECT($B$5&\"_key[RAMM field name]\"),0),1),INDIRECT($B$5&\"_\"&$C$5&\"[#Headers]\"),0))))","v":{"$error":"#N/A"}},{"$f":"IF(ISBLANK(INDEX(INDIRECT($B$5&\"_\"&$C$5),ROW()-13,MATCH(INDEX(INDIRECT($B$5&\"_key\"),MATCH(AC$13,INDIRECT($B$5&\"_key[RAMM field name]\"),0),1),INDIRECT($B$5&\"_\"&$C$5&\"[#Headers]\"),0))),\nIF(INDEX(INDIRECT($B$5&\"_key\"),MATCH(AC$13,INDIRECT($B$5&\"_key[RAMM field name]\"),0),6)=\"Y\",\"\"&INDEX(INDIRECT($B$5&\"_key\"),MATCH(AC$13,INDIRECT($B$5&\"_key[RAMM field name]\"),0),7),\"\"),\nIF(INDEX(INDIRECT($B$5&\"_key\"),MATCH(AC$13,INDIRECT($B$5&\"_key[RAMM field name]\"),0),3)=\"lookup\",\nINDEX(INDIRECT(INDEX(INDIRECT($B$5&\"_key\"),MATCH(AC$13,INDIRECT($B$5&\"_key[RAMM field name]\"),0),4)),\nMATCH(INDEX(INDIRECT($B$5&\"_\"&$C$5),ROW()-13,MATCH(INDEX(INDIRECT($B$5&\"_key\"),MATCH(AC$13,INDIRECT($B$5&\"_key[RAMM field name]\"),0),1),INDIRECT($B$5&\"_\"&$C$5&\"[#Headers]\"),0)),\nINDIRECT(INDEX(INDIRECT($B$5&\"_key\"),MATCH(AC$13,INDIRECT($B$5&\"_key[RAMM field name]\"),0),4)&\"[\"&INDEX(INDIRECT($B$5&\"_key\"),MATCH(AC$13,INDIRECT($B$5&\"_key[RAMM field name]\"),0),2)&\"]\"),0),1),\nINDEX(INDIRECT($B$5&\"_\"&$C$5),ROW()-13,MATCH(INDEX(INDIRECT($B$5&\"_key\"),MATCH(AC$13,INDIRECT($B$5&\"_key[RAMM field name]\"),0),1),INDIRECT($B$5&\"_\"&$C$5&\"[#Headers]\"),0))))","v":{"$error":"#N/A"}},{"$f":"IF(ISBLANK(INDEX(INDIRECT($B$5&\"_\"&$C$5),ROW()-13,MATCH(INDEX(INDIRECT($B$5&\"_key\"),MATCH(AD$13,INDIRECT($B$5&\"_key[RAMM field name]\"),0),1),INDIRECT($B$5&\"_\"&$C$5&\"[#Headers]\"),0))),\nIF(INDEX(INDIRECT($B$5&\"_key\"),MATCH(AD$13,INDIRECT($B$5&\"_key[RAMM field name]\"),0),6)=\"Y\",\"\"&INDEX(INDIRECT($B$5&\"_key\"),MATCH(AD$13,INDIRECT($B$5&\"_key[RAMM field name]\"),0),7),\"\"),\nIF(INDEX(INDIRECT($B$5&\"_key\"),MATCH(AD$13,INDIRECT($B$5&\"_key[RAMM field name]\"),0),3)=\"lookup\",\nINDEX(INDIRECT(INDEX(INDIRECT($B$5&\"_key\"),MATCH(AD$13,INDIRECT($B$5&\"_key[RAMM field name]\"),0),4)),\nMATCH(INDEX(INDIRECT($B$5&\"_\"&$C$5),ROW()-13,MATCH(INDEX(INDIRECT($B$5&\"_key\"),MATCH(AD$13,INDIRECT($B$5&\"_key[RAMM field name]\"),0),1),INDIRECT($B$5&\"_\"&$C$5&\"[#Headers]\"),0)),\nINDIRECT(INDEX(INDIRECT($B$5&\"_key\"),MATCH(AD$13,INDIRECT($B$5&\"_key[RAMM field name]\"),0),4)&\"[\"&INDEX(INDIRECT($B$5&\"_key\"),MATCH(AD$13,INDIRECT($B$5&\"_key[RAMM field name]\"),0),2)&\"]\"),0),1),\nINDEX(INDIRECT($B$5&\"_\"&$C$5),ROW()-13,MATCH(INDEX(INDIRECT($B$5&\"_key\"),MATCH(AD$13,INDIRECT($B$5&\"_key[RAMM field name]\"),0),1),INDIRECT($B$5&\"_\"&$C$5&\"[#Headers]\"),0))))","v":{"$error":"#N/A"}},{"$f":"IF(ISBLANK(INDEX(INDIRECT($B$5&\"_\"&$C$5),ROW()-13,MATCH(INDEX(INDIRECT($B$5&\"_key\"),MATCH(AE$13,INDIRECT($B$5&\"_key[RAMM field name]\"),0),1),INDIRECT($B$5&\"_\"&$C$5&\"[#Headers]\"),0))),\nIF(INDEX(INDIRECT($B$5&\"_key\"),MATCH(AE$13,INDIRECT($B$5&\"_key[RAMM field name]\"),0),6)=\"Y\",\"\"&INDEX(INDIRECT($B$5&\"_key\"),MATCH(AE$13,INDIRECT($B$5&\"_key[RAMM field name]\"),0),7),\"\"),\nIF(INDEX(INDIRECT($B$5&\"_key\"),MATCH(AE$13,INDIRECT($B$5&\"_key[RAMM field name]\"),0),3)=\"lookup\",\nINDEX(INDIRECT(INDEX(INDIRECT($B$5&\"_key\"),MATCH(AE$13,INDIRECT($B$5&\"_key[RAMM field name]\"),0),4)),\nMATCH(INDEX(INDIRECT($B$5&\"_\"&$C$5),ROW()-13,MATCH(INDEX(INDIRECT($B$5&\"_key\"),MATCH(AE$13,INDIRECT($B$5&\"_key[RAMM field name]\"),0),1),INDIRECT($B$5&\"_\"&$C$5&\"[#Headers]\"),0)),\nINDIRECT(INDEX(INDIRECT($B$5&\"_key\"),MATCH(AE$13,INDIRECT($B$5&\"_key[RAMM field name]\"),0),4)&\"[\"&INDEX(INDIRECT($B$5&\"_key\"),MATCH(AE$13,INDIRECT($B$5&\"_key[RAMM field name]\"),0),2)&\"]\"),0),1),\nINDEX(INDIRECT($B$5&\"_\"&$C$5),ROW()-13,MATCH(INDEX(INDIRECT($B$5&\"_key\"),MATCH(AE$13,INDIRECT($B$5&\"_key[RAMM field name]\"),0),1),INDIRECT($B$5&\"_\"&$C$5&\"[#Headers]\"),0))))","v":{"$error":"#N/A"}},{"$f":"IF(ISBLANK(INDEX(INDIRECT($B$5&\"_\"&$C$5),ROW()-13,MATCH(INDEX(INDIRECT($B$5&\"_key\"),MATCH(AF$13,INDIRECT($B$5&\"_key[RAMM field name]\"),0),1),INDIRECT($B$5&\"_\"&$C$5&\"[#Headers]\"),0))),\nIF(INDEX(INDIRECT($B$5&\"_key\"),MATCH(AF$13,INDIRECT($B$5&\"_key[RAMM field name]\"),0),6)=\"Y\",\"\"&INDEX(INDIRECT($B$5&\"_key\"),MATCH(AF$13,INDIRECT($B$5&\"_key[RAMM field name]\"),0),7),\"\"),\nIF(INDEX(INDIRECT($B$5&\"_key\"),MATCH(AF$13,INDIRECT($B$5&\"_key[RAMM field name]\"),0),3)=\"lookup\",\nINDEX(INDIRECT(INDEX(INDIRECT($B$5&\"_key\"),MATCH(AF$13,INDIRECT($B$5&\"_key[RAMM field name]\"),0),4)),\nMATCH(INDEX(INDIRECT($B$5&\"_\"&$C$5),ROW()-13,MATCH(INDEX(INDIRECT($B$5&\"_key\"),MATCH(AF$13,INDIRECT($B$5&\"_key[RAMM field name]\"),0),1),INDIRECT($B$5&\"_\"&$C$5&\"[#Headers]\"),0)),\nINDIRECT(INDEX(INDIRECT($B$5&\"_key\"),MATCH(AF$13,INDIRECT($B$5&\"_key[RAMM field name]\"),0),4)&\"[\"&INDEX(INDIRECT($B$5&\"_key\"),MATCH(AF$13,INDIRECT($B$5&\"_key[RAMM field name]\"),0),2)&\"]\"),0),1),\nINDEX(INDIRECT($B$5&\"_\"&$C$5),ROW()-13,MATCH(INDEX(INDIRECT($B$5&\"_key\"),MATCH(AF$13,INDIRECT($B$5&\"_key[RAMM field name]\"),0),1),INDIRECT($B$5&\"_\"&$C$5&\"[#Headers]\"),0))))","v":{"$error":"#N/A"}},{"$f":"IF(ISBLANK(INDEX(INDIRECT($B$5&\"_\"&$C$5),ROW()-13,MATCH(INDEX(INDIRECT($B$5&\"_key\"),MATCH(AG$13,INDIRECT($B$5&\"_key[RAMM field name]\"),0),1),INDIRECT($B$5&\"_\"&$C$5&\"[#Headers]\"),0))),\nIF(INDEX(INDIRECT($B$5&\"_key\"),MATCH(AG$13,INDIRECT($B$5&\"_key[RAMM field name]\"),0),6)=\"Y\",\"\"&INDEX(INDIRECT($B$5&\"_key\"),MATCH(AG$13,INDIRECT($B$5&\"_key[RAMM field name]\"),0),7),\"\"),\nIF(INDEX(INDIRECT($B$5&\"_key\"),MATCH(AG$13,INDIRECT($B$5&\"_key[RAMM field name]\"),0),3)=\"lookup\",\nINDEX(INDIRECT(INDEX(INDIRECT($B$5&\"_key\"),MATCH(AG$13,INDIRECT($B$5&\"_key[RAMM field name]\"),0),4)),\nMATCH(INDEX(INDIRECT($B$5&\"_\"&$C$5),ROW()-13,MATCH(INDEX(INDIRECT($B$5&\"_key\"),MATCH(AG$13,INDIRECT($B$5&\"_key[RAMM field name]\"),0),1),INDIRECT($B$5&\"_\"&$C$5&\"[#Headers]\"),0)),\nINDIRECT(INDEX(INDIRECT($B$5&\"_key\"),MATCH(AG$13,INDIRECT($B$5&\"_key[RAMM field name]\"),0),4)&\"[\"&INDEX(INDIRECT($B$5&\"_key\"),MATCH(AG$13,INDIRECT($B$5&\"_key[RAMM field name]\"),0),2)&\"]\"),0),1),\nINDEX(INDIRECT($B$5&\"_\"&$C$5),ROW()-13,MATCH(INDEX(INDIRECT($B$5&\"_key\"),MATCH(AG$13,INDIRECT($B$5&\"_key[RAMM field name]\"),0),1),INDIRECT($B$5&\"_\"&$C$5&\"[#Headers]\"),0))))","v":{"$error":"#N/A"}},{"$f":"IF(ISBLANK(INDEX(INDIRECT($B$5&\"_\"&$C$5),ROW()-13,MATCH(INDEX(INDIRECT($B$5&\"_key\"),MATCH(AH$13,INDIRECT($B$5&\"_key[RAMM field name]\"),0),1),INDIRECT($B$5&\"_\"&$C$5&\"[#Headers]\"),0))),\nIF(INDEX(INDIRECT($B$5&\"_key\"),MATCH(AH$13,INDIRECT($B$5&\"_key[RAMM field name]\"),0),6)=\"Y\",\"\"&INDEX(INDIRECT($B$5&\"_key\"),MATCH(AH$13,INDIRECT($B$5&\"_key[RAMM field name]\"),0),7),\"\"),\nIF(INDEX(INDIRECT($B$5&\"_key\"),MATCH(AH$13,INDIRECT($B$5&\"_key[RAMM field name]\"),0),3)=\"lookup\",\nINDEX(INDIRECT(INDEX(INDIRECT($B$5&\"_key\"),MATCH(AH$13,INDIRECT($B$5&\"_key[RAMM field name]\"),0),4)),\nMATCH(INDEX(INDIRECT($B$5&\"_\"&$C$5),ROW()-13,MATCH(INDEX(INDIRECT($B$5&\"_key\"),MATCH(AH$13,INDIRECT($B$5&\"_key[RAMM field name]\"),0),1),INDIRECT($B$5&\"_\"&$C$5&\"[#Headers]\"),0)),\nINDIRECT(INDEX(INDIRECT($B$5&\"_key\"),MATCH(AH$13,INDIRECT($B$5&\"_key[RAMM field name]\"),0),4)&\"[\"&INDEX(INDIRECT($B$5&\"_key\"),MATCH(AH$13,INDIRECT($B$5&\"_key[RAMM field name]\"),0),2)&\"]\"),0),1),\nINDEX(INDIRECT($B$5&\"_\"&$C$5),ROW()-13,MATCH(INDEX(INDIRECT($B$5&\"_key\"),MATCH(AH$13,INDIRECT($B$5&\"_key[RAMM field name]\"),0),1),INDIRECT($B$5&\"_\"&$C$5&\"[#Headers]\"),0))))","v":{"$error":"#N/A"}},{"$f":"IF(ISBLANK(INDEX(INDIRECT($B$5&\"_\"&$C$5),ROW()-13,MATCH(INDEX(INDIRECT($B$5&\"_key\"),MATCH(AI$13,INDIRECT($B$5&\"_key[RAMM field name]\"),0),1),INDIRECT($B$5&\"_\"&$C$5&\"[#Headers]\"),0))),\nIF(INDEX(INDIRECT($B$5&\"_key\"),MATCH(AI$13,INDIRECT($B$5&\"_key[RAMM field name]\"),0),6)=\"Y\",\"\"&INDEX(INDIRECT($B$5&\"_key\"),MATCH(AI$13,INDIRECT($B$5&\"_key[RAMM field name]\"),0),7),\"\"),\nIF(INDEX(INDIRECT($B$5&\"_key\"),MATCH(AI$13,INDIRECT($B$5&\"_key[RAMM field name]\"),0),3)=\"lookup\",\nINDEX(INDIRECT(INDEX(INDIRECT($B$5&\"_key\"),MATCH(AI$13,INDIRECT($B$5&\"_key[RAMM field name]\"),0),4)),\nMATCH(INDEX(INDIRECT($B$5&\"_\"&$C$5),ROW()-13,MATCH(INDEX(INDIRECT($B$5&\"_key\"),MATCH(AI$13,INDIRECT($B$5&\"_key[RAMM field name]\"),0),1),INDIRECT($B$5&\"_\"&$C$5&\"[#Headers]\"),0)),\nINDIRECT(INDEX(INDIRECT($B$5&\"_key\"),MATCH(AI$13,INDIRECT($B$5&\"_key[RAMM field name]\"),0),4)&\"[\"&INDEX(INDIRECT($B$5&\"_key\"),MATCH(AI$13,INDIRECT($B$5&\"_key[RAMM field name]\"),0),2)&\"]\"),0),1),\nINDEX(INDIRECT($B$5&\"_\"&$C$5),ROW()-13,MATCH(INDEX(INDIRECT($B$5&\"_key\"),MATCH(AI$13,INDIRECT($B$5&\"_key[RAMM field name]\"),0),1),INDIRECT($B$5&\"_\"&$C$5&\"[#Headers]\"),0))))","v":{"$error":"#N/A"}},{"$f":"IF(ISBLANK(INDEX(INDIRECT($B$5&\"_\"&$C$5),ROW()-13,MATCH(INDEX(INDIRECT($B$5&\"_key\"),MATCH(AJ$13,INDIRECT($B$5&\"_key[RAMM field name]\"),0),1),INDIRECT($B$5&\"_\"&$C$5&\"[#Headers]\"),0))),\nIF(INDEX(INDIRECT($B$5&\"_key\"),MATCH(AJ$13,INDIRECT($B$5&\"_key[RAMM field name]\"),0),6)=\"Y\",\"\"&INDEX(INDIRECT($B$5&\"_key\"),MATCH(AJ$13,INDIRECT($B$5&\"_key[RAMM field name]\"),0),7),\"\"),\nIF(INDEX(INDIRECT($B$5&\"_key\"),MATCH(AJ$13,INDIRECT($B$5&\"_key[RAMM field name]\"),0),3)=\"lookup\",\nINDEX(INDIRECT(INDEX(INDIRECT($B$5&\"_key\"),MATCH(AJ$13,INDIRECT($B$5&\"_key[RAMM field name]\"),0),4)),\nMATCH(INDEX(INDIRECT($B$5&\"_\"&$C$5),ROW()-13,MATCH(INDEX(INDIRECT($B$5&\"_key\"),MATCH(AJ$13,INDIRECT($B$5&\"_key[RAMM field name]\"),0),1),INDIRECT($B$5&\"_\"&$C$5&\"[#Headers]\"),0)),\nINDIRECT(INDEX(INDIRECT($B$5&\"_key\"),MATCH(AJ$13,INDIRECT($B$5&\"_key[RAMM field name]\"),0),4)&\"[\"&INDEX(INDIRECT($B$5&\"_key\"),MATCH(AJ$13,INDIRECT($B$5&\"_key[RAMM field name]\"),0),2)&\"]\"),0),1),\nINDEX(INDIRECT($B$5&\"_\"&$C$5),ROW()-13,MATCH(INDEX(INDIRECT($B$5&\"_key\"),MATCH(AJ$13,INDIRECT($B$5&\"_key[RAMM field name]\"),0),1),INDIRECT($B$5&\"_\"&$C$5&\"[#Headers]\"),0))))","v":{"$error":"#N/A"}},{"$f":"IF(ISBLANK(INDEX(INDIRECT($B$5&\"_\"&$C$5),ROW()-13,MATCH(INDEX(INDIRECT($B$5&\"_key\"),MATCH(AK$13,INDIRECT($B$5&\"_key[RAMM field name]\"),0),1),INDIRECT($B$5&\"_\"&$C$5&\"[#Headers]\"),0))),\nIF(INDEX(INDIRECT($B$5&\"_key\"),MATCH(AK$13,INDIRECT($B$5&\"_key[RAMM field name]\"),0),6)=\"Y\",\"\"&INDEX(INDIRECT($B$5&\"_key\"),MATCH(AK$13,INDIRECT($B$5&\"_key[RAMM field name]\"),0),7),\"\"),\nIF(INDEX(INDIRECT($B$5&\"_key\"),MATCH(AK$13,INDIRECT($B$5&\"_key[RAMM field name]\"),0),3)=\"lookup\",\nINDEX(INDIRECT(INDEX(INDIRECT($B$5&\"_key\"),MATCH(AK$13,INDIRECT($B$5&\"_key[RAMM field name]\"),0),4)),\nMATCH(INDEX(INDIRECT($B$5&\"_\"&$C$5),ROW()-13,MATCH(INDEX(INDIRECT($B$5&\"_key\"),MATCH(AK$13,INDIRECT($B$5&\"_key[RAMM field name]\"),0),1),INDIRECT($B$5&\"_\"&$C$5&\"[#Headers]\"),0)),\nINDIRECT(INDEX(INDIRECT($B$5&\"_key\"),MATCH(AK$13,INDIRECT($B$5&\"_key[RAMM field name]\"),0),4)&\"[\"&INDEX(INDIRECT($B$5&\"_key\"),MATCH(AK$13,INDIRECT($B$5&\"_key[RAMM field name]\"),0),2)&\"]\"),0),1),\nINDEX(INDIRECT($B$5&\"_\"&$C$5),ROW()-13,MATCH(INDEX(INDIRECT($B$5&\"_key\"),MATCH(AK$13,INDIRECT($B$5&\"_key[RAMM field name]\"),0),1),INDIRECT($B$5&\"_\"&$C$5&\"[#Headers]\"),0))))","v":{"$error":"#N/A"}},{"$f":"IF(ISBLANK(INDEX(INDIRECT($B$5&\"_\"&$C$5),ROW()-13,MATCH(INDEX(INDIRECT($B$5&\"_key\"),MATCH(AL$13,INDIRECT($B$5&\"_key[RAMM field name]\"),0),1),INDIRECT($B$5&\"_\"&$C$5&\"[#Headers]\"),0))),\nIF(INDEX(INDIRECT($B$5&\"_key\"),MATCH(AL$13,INDIRECT($B$5&\"_key[RAMM field name]\"),0),6)=\"Y\",\"\"&INDEX(INDIRECT($B$5&\"_key\"),MATCH(AL$13,INDIRECT($B$5&\"_key[RAMM field name]\"),0),7),\"\"),\nIF(INDEX(INDIRECT($B$5&\"_key\"),MATCH(AL$13,INDIRECT($B$5&\"_key[RAMM field name]\"),0),3)=\"lookup\",\nINDEX(INDIRECT(INDEX(INDIRECT($B$5&\"_key\"),MATCH(AL$13,INDIRECT($B$5&\"_key[RAMM field name]\"),0),4)),\nMATCH(INDEX(INDIRECT($B$5&\"_\"&$C$5),ROW()-13,MATCH(INDEX(INDIRECT($B$5&\"_key\"),MATCH(AL$13,INDIRECT($B$5&\"_key[RAMM field name]\"),0),1),INDIRECT($B$5&\"_\"&$C$5&\"[#Headers]\"),0)),\nINDIRECT(INDEX(INDIRECT($B$5&\"_key\"),MATCH(AL$13,INDIRECT($B$5&\"_key[RAMM field name]\"),0),4)&\"[\"&INDEX(INDIRECT($B$5&\"_key\"),MATCH(AL$13,INDIRECT($B$5&\"_key[RAMM field name]\"),0),2)&\"]\"),0),1),\nINDEX(INDIRECT($B$5&\"_\"&$C$5),ROW()-13,MATCH(INDEX(INDIRECT($B$5&\"_key\"),MATCH(AL$13,INDIRECT($B$5&\"_key[RAMM field name]\"),0),1),INDIRECT($B$5&\"_\"&$C$5&\"[#Headers]\"),0))))","v":{"$error":"#N/A"}},{"$f":"IF(ISBLANK(INDEX(INDIRECT($B$5&\"_\"&$C$5),ROW()-13,MATCH(INDEX(INDIRECT($B$5&\"_key\"),MATCH(AM$13,INDIRECT($B$5&\"_key[RAMM field name]\"),0),1),INDIRECT($B$5&\"_\"&$C$5&\"[#Headers]\"),0))),\nIF(INDEX(INDIRECT($B$5&\"_key\"),MATCH(AM$13,INDIRECT($B$5&\"_key[RAMM field name]\"),0),6)=\"Y\",\"\"&INDEX(INDIRECT($B$5&\"_key\"),MATCH(AM$13,INDIRECT($B$5&\"_key[RAMM field name]\"),0),7),\"\"),\nIF(INDEX(INDIRECT($B$5&\"_key\"),MATCH(AM$13,INDIRECT($B$5&\"_key[RAMM field name]\"),0),3)=\"lookup\",\nINDEX(INDIRECT(INDEX(INDIRECT($B$5&\"_key\"),MATCH(AM$13,INDIRECT($B$5&\"_key[RAMM field name]\"),0),4)),\nMATCH(INDEX(INDIRECT($B$5&\"_\"&$C$5),ROW()-13,MATCH(INDEX(INDIRECT($B$5&\"_key\"),MATCH(AM$13,INDIRECT($B$5&\"_key[RAMM field name]\"),0),1),INDIRECT($B$5&\"_\"&$C$5&\"[#Headers]\"),0)),\nINDIRECT(INDEX(INDIRECT($B$5&\"_key\"),MATCH(AM$13,INDIRECT($B$5&\"_key[RAMM field name]\"),0),4)&\"[\"&INDEX(INDIRECT($B$5&\"_key\"),MATCH(AM$13,INDIRECT($B$5&\"_key[RAMM field name]\"),0),2)&\"]\"),0),1),\nINDEX(INDIRECT($B$5&\"_\"&$C$5),ROW()-13,MATCH(INDEX(INDIRECT($B$5&\"_key\"),MATCH(AM$13,INDIRECT($B$5&\"_key[RAMM field name]\"),0),1),INDIRECT($B$5&\"_\"&$C$5&\"[#Headers]\"),0))))","v":{"$error":"#N/A"}},{"$f":"IF(ISBLANK(INDEX(INDIRECT($B$5&\"_\"&$C$5),ROW()-13,MATCH(INDEX(INDIRECT($B$5&\"_key\"),MATCH(AN$13,INDIRECT($B$5&\"_key[RAMM field name]\"),0),1),INDIRECT($B$5&\"_\"&$C$5&\"[#Headers]\"),0))),\nIF(INDEX(INDIRECT($B$5&\"_key\"),MATCH(AN$13,INDIRECT($B$5&\"_key[RAMM field name]\"),0),6)=\"Y\",\"\"&INDEX(INDIRECT($B$5&\"_key\"),MATCH(AN$13,INDIRECT($B$5&\"_key[RAMM field name]\"),0),7),\"\"),\nIF(INDEX(INDIRECT($B$5&\"_key\"),MATCH(AN$13,INDIRECT($B$5&\"_key[RAMM field name]\"),0),3)=\"lookup\",\nINDEX(INDIRECT(INDEX(INDIRECT($B$5&\"_key\"),MATCH(AN$13,INDIRECT($B$5&\"_key[RAMM field name]\"),0),4)),\nMATCH(INDEX(INDIRECT($B$5&\"_\"&$C$5),ROW()-13,MATCH(INDEX(INDIRECT($B$5&\"_key\"),MATCH(AN$13,INDIRECT($B$5&\"_key[RAMM field name]\"),0),1),INDIRECT($B$5&\"_\"&$C$5&\"[#Headers]\"),0)),\nINDIRECT(INDEX(INDIRECT($B$5&\"_key\"),MATCH(AN$13,INDIRECT($B$5&\"_key[RAMM field name]\"),0),4)&\"[\"&INDEX(INDIRECT($B$5&\"_key\"),MATCH(AN$13,INDIRECT($B$5&\"_key[RAMM field name]\"),0),2)&\"]\"),0),1),\nINDEX(INDIRECT($B$5&\"_\"&$C$5),ROW()-13,MATCH(INDEX(INDIRECT($B$5&\"_key\"),MATCH(AN$13,INDIRECT($B$5&\"_key[RAMM field name]\"),0),1),INDIRECT($B$5&\"_\"&$C$5&\"[#Headers]\"),0))))","v":{"$error":"#N/A"}},{"$f":"IF(ISBLANK(INDEX(INDIRECT($B$5&\"_\"&$C$5),ROW()-13,MATCH(INDEX(INDIRECT($B$5&\"_key\"),MATCH(AO$13,INDIRECT($B$5&\"_key[RAMM field name]\"),0),1),INDIRECT($B$5&\"_\"&$C$5&\"[#Headers]\"),0))),\nIF(INDEX(INDIRECT($B$5&\"_key\"),MATCH(AO$13,INDIRECT($B$5&\"_key[RAMM field name]\"),0),6)=\"Y\",\"\"&INDEX(INDIRECT($B$5&\"_key\"),MATCH(AO$13,INDIRECT($B$5&\"_key[RAMM field name]\"),0),7),\"\"),\nIF(INDEX(INDIRECT($B$5&\"_key\"),MATCH(AO$13,INDIRECT($B$5&\"_key[RAMM field name]\"),0),3)=\"lookup\",\nINDEX(INDIRECT(INDEX(INDIRECT($B$5&\"_key\"),MATCH(AO$13,INDIRECT($B$5&\"_key[RAMM field name]\"),0),4)),\nMATCH(INDEX(INDIRECT($B$5&\"_\"&$C$5),ROW()-13,MATCH(INDEX(INDIRECT($B$5&\"_key\"),MATCH(AO$13,INDIRECT($B$5&\"_key[RAMM field name]\"),0),1),INDIRECT($B$5&\"_\"&$C$5&\"[#Headers]\"),0)),\nINDIRECT(INDEX(INDIRECT($B$5&\"_key\"),MATCH(AO$13,INDIRECT($B$5&\"_key[RAMM field name]\"),0),4)&\"[\"&INDEX(INDIRECT($B$5&\"_key\"),MATCH(AO$13,INDIRECT($B$5&\"_key[RAMM field name]\"),0),2)&\"]\"),0),1),\nINDEX(INDIRECT($B$5&\"_\"&$C$5),ROW()-13,MATCH(INDEX(INDIRECT($B$5&\"_key\"),MATCH(AO$13,INDIRECT($B$5&\"_key[RAMM field name]\"),0),1),INDIRECT($B$5&\"_\"&$C$5&\"[#Headers]\"),0))))","v":{"$error":"#N/A"}},{"$f":"IF(ISBLANK(INDEX(INDIRECT($B$5&\"_\"&$C$5),ROW()-13,MATCH(INDEX(INDIRECT($B$5&\"_key\"),MATCH(AP$13,INDIRECT($B$5&\"_key[RAMM field name]\"),0),1),INDIRECT($B$5&\"_\"&$C$5&\"[#Headers]\"),0))),\nIF(INDEX(INDIRECT($B$5&\"_key\"),MATCH(AP$13,INDIRECT($B$5&\"_key[RAMM field name]\"),0),6)=\"Y\",\"\"&INDEX(INDIRECT($B$5&\"_key\"),MATCH(AP$13,INDIRECT($B$5&\"_key[RAMM field name]\"),0),7),\"\"),\nIF(INDEX(INDIRECT($B$5&\"_key\"),MATCH(AP$13,INDIRECT($B$5&\"_key[RAMM field name]\"),0),3)=\"lookup\",\nINDEX(INDIRECT(INDEX(INDIRECT($B$5&\"_key\"),MATCH(AP$13,INDIRECT($B$5&\"_key[RAMM field name]\"),0),4)),\nMATCH(INDEX(INDIRECT($B$5&\"_\"&$C$5),ROW()-13,MATCH(INDEX(INDIRECT($B$5&\"_key\"),MATCH(AP$13,INDIRECT($B$5&\"_key[RAMM field name]\"),0),1),INDIRECT($B$5&\"_\"&$C$5&\"[#Headers]\"),0)),\nINDIRECT(INDEX(INDIRECT($B$5&\"_key\"),MATCH(AP$13,INDIRECT($B$5&\"_key[RAMM field name]\"),0),4)&\"[\"&INDEX(INDIRECT($B$5&\"_key\"),MATCH(AP$13,INDIRECT($B$5&\"_key[RAMM field name]\"),0),2)&\"]\"),0),1),\nINDEX(INDIRECT($B$5&\"_\"&$C$5),ROW()-13,MATCH(INDEX(INDIRECT($B$5&\"_key\"),MATCH(AP$13,INDIRECT($B$5&\"_key[RAMM field name]\"),0),1),INDIRECT($B$5&\"_\"&$C$5&\"[#Headers]\"),0))))","v":{"$error":"#N/A"}},{"$f":"IF(ISBLANK(INDEX(INDIRECT($B$5&\"_\"&$C$5),ROW()-13,MATCH(INDEX(INDIRECT($B$5&\"_key\"),MATCH(AQ$13,INDIRECT($B$5&\"_key[RAMM field name]\"),0),1),INDIRECT($B$5&\"_\"&$C$5&\"[#Headers]\"),0))),\nIF(INDEX(INDIRECT($B$5&\"_key\"),MATCH(AQ$13,INDIRECT($B$5&\"_key[RAMM field name]\"),0),6)=\"Y\",\"\"&INDEX(INDIRECT($B$5&\"_key\"),MATCH(AQ$13,INDIRECT($B$5&\"_key[RAMM field name]\"),0),7),\"\"),\nIF(INDEX(INDIRECT($B$5&\"_key\"),MATCH(AQ$13,INDIRECT($B$5&\"_key[RAMM field name]\"),0),3)=\"lookup\",\nINDEX(INDIRECT(INDEX(INDIRECT($B$5&\"_key\"),MATCH(AQ$13,INDIRECT($B$5&\"_key[RAMM field name]\"),0),4)),\nMATCH(INDEX(INDIRECT($B$5&\"_\"&$C$5),ROW()-13,MATCH(INDEX(INDIRECT($B$5&\"_key\"),MATCH(AQ$13,INDIRECT($B$5&\"_key[RAMM field name]\"),0),1),INDIRECT($B$5&\"_\"&$C$5&\"[#Headers]\"),0)),\nINDIRECT(INDEX(INDIRECT($B$5&\"_key\"),MATCH(AQ$13,INDIRECT($B$5&\"_key[RAMM field name]\"),0),4)&\"[\"&INDEX(INDIRECT($B$5&\"_key\"),MATCH(AQ$13,INDIRECT($B$5&\"_key[RAMM field name]\"),0),2)&\"]\"),0),1),\nINDEX(INDIRECT($B$5&\"_\"&$C$5),ROW()-13,MATCH(INDEX(INDIRECT($B$5&\"_key\"),MATCH(AQ$13,INDIRECT($B$5&\"_key[RAMM field name]\"),0),1),INDIRECT($B$5&\"_\"&$C$5&\"[#Headers]\"),0))))","v":{"$error":"#N/A"}},{"$f":"IF(ISBLANK(INDEX(INDIRECT($B$5&\"_\"&$C$5),ROW()-13,MATCH(INDEX(INDIRECT($B$5&\"_key\"),MATCH(AR$13,INDIRECT($B$5&\"_key[RAMM field name]\"),0),1),INDIRECT($B$5&\"_\"&$C$5&\"[#Headers]\"),0))),\nIF(INDEX(INDIRECT($B$5&\"_key\"),MATCH(AR$13,INDIRECT($B$5&\"_key[RAMM field name]\"),0),6)=\"Y\",\"\"&INDEX(INDIRECT($B$5&\"_key\"),MATCH(AR$13,INDIRECT($B$5&\"_key[RAMM field name]\"),0),7),\"\"),\nIF(INDEX(INDIRECT($B$5&\"_key\"),MATCH(AR$13,INDIRECT($B$5&\"_key[RAMM field name]\"),0),3)=\"lookup\",\nINDEX(INDIRECT(INDEX(INDIRECT($B$5&\"_key\"),MATCH(AR$13,INDIRECT($B$5&\"_key[RAMM field name]\"),0),4)),\nMATCH(INDEX(INDIRECT($B$5&\"_\"&$C$5),ROW()-13,MATCH(INDEX(INDIRECT($B$5&\"_key\"),MATCH(AR$13,INDIRECT($B$5&\"_key[RAMM field name]\"),0),1),INDIRECT($B$5&\"_\"&$C$5&\"[#Headers]\"),0)),\nINDIRECT(INDEX(INDIRECT($B$5&\"_key\"),MATCH(AR$13,INDIRECT($B$5&\"_key[RAMM field name]\"),0),4)&\"[\"&INDEX(INDIRECT($B$5&\"_key\"),MATCH(AR$13,INDIRECT($B$5&\"_key[RAMM field name]\"),0),2)&\"]\"),0),1),\nINDEX(INDIRECT($B$5&\"_\"&$C$5),ROW()-13,MATCH(INDEX(INDIRECT($B$5&\"_key\"),MATCH(AR$13,INDIRECT($B$5&\"_key[RAMM field name]\"),0),1),INDIRECT($B$5&\"_\"&$C$5&\"[#Headers]\"),0))))","v":{"$error":"#N/A"}},{"$f":"IF(ISBLANK(INDEX(INDIRECT($B$5&\"_\"&$C$5),ROW()-13,MATCH(INDEX(INDIRECT($B$5&\"_key\"),MATCH(AS$13,INDIRECT($B$5&\"_key[RAMM field name]\"),0),1),INDIRECT($B$5&\"_\"&$C$5&\"[#Headers]\"),0))),\nIF(INDEX(INDIRECT($B$5&\"_key\"),MATCH(AS$13,INDIRECT($B$5&\"_key[RAMM field name]\"),0),6)=\"Y\",\"\"&INDEX(INDIRECT($B$5&\"_key\"),MATCH(AS$13,INDIRECT($B$5&\"_key[RAMM field name]\"),0),7),\"\"),\nIF(INDEX(INDIRECT($B$5&\"_key\"),MATCH(AS$13,INDIRECT($B$5&\"_key[RAMM field name]\"),0),3)=\"lookup\",\nINDEX(INDIRECT(INDEX(INDIRECT($B$5&\"_key\"),MATCH(AS$13,INDIRECT($B$5&\"_key[RAMM field name]\"),0),4)),\nMATCH(INDEX(INDIRECT($B$5&\"_\"&$C$5),ROW()-13,MATCH(INDEX(INDIRECT($B$5&\"_key\"),MATCH(AS$13,INDIRECT($B$5&\"_key[RAMM field name]\"),0),1),INDIRECT($B$5&\"_\"&$C$5&\"[#Headers]\"),0)),\nINDIRECT(INDEX(INDIRECT($B$5&\"_key\"),MATCH(AS$13,INDIRECT($B$5&\"_key[RAMM field name]\"),0),4)&\"[\"&INDEX(INDIRECT($B$5&\"_key\"),MATCH(AS$13,INDIRECT($B$5&\"_key[RAMM field name]\"),0),2)&\"]\"),0),1),\nINDEX(INDIRECT($B$5&\"_\"&$C$5),ROW()-13,MATCH(INDEX(INDIRECT($B$5&\"_key\"),MATCH(AS$13,INDIRECT($B$5&\"_key[RAMM field name]\"),0),1),INDIRECT($B$5&\"_\"&$C$5&\"[#Headers]\"),0))))","v":{"$error":"#N/A"}},{"$f":"IF(ISBLANK(INDEX(INDIRECT($B$5&\"_\"&$C$5),ROW()-13,MATCH(INDEX(INDIRECT($B$5&\"_key\"),MATCH(AT$13,INDIRECT($B$5&\"_key[RAMM field name]\"),0),1),INDIRECT($B$5&\"_\"&$C$5&\"[#Headers]\"),0))),\nIF(INDEX(INDIRECT($B$5&\"_key\"),MATCH(AT$13,INDIRECT($B$5&\"_key[RAMM field name]\"),0),6)=\"Y\",\"\"&INDEX(INDIRECT($B$5&\"_key\"),MATCH(AT$13,INDIRECT($B$5&\"_key[RAMM field name]\"),0),7),\"\"),\nIF(INDEX(INDIRECT($B$5&\"_key\"),MATCH(AT$13,INDIRECT($B$5&\"_key[RAMM field name]\"),0),3)=\"lookup\",\nINDEX(INDIRECT(INDEX(INDIRECT($B$5&\"_key\"),MATCH(AT$13,INDIRECT($B$5&\"_key[RAMM field name]\"),0),4)),\nMATCH(INDEX(INDIRECT($B$5&\"_\"&$C$5),ROW()-13,MATCH(INDEX(INDIRECT($B$5&\"_key\"),MATCH(AT$13,INDIRECT($B$5&\"_key[RAMM field name]\"),0),1),INDIRECT($B$5&\"_\"&$C$5&\"[#Headers]\"),0)),\nINDIRECT(INDEX(INDIRECT($B$5&\"_key\"),MATCH(AT$13,INDIRECT($B$5&\"_key[RAMM field name]\"),0),4)&\"[\"&INDEX(INDIRECT($B$5&\"_key\"),MATCH(AT$13,INDIRECT($B$5&\"_key[RAMM field name]\"),0),2)&\"]\"),0),1),\nINDEX(INDIRECT($B$5&\"_\"&$C$5),ROW()-13,MATCH(INDEX(INDIRECT($B$5&\"_key\"),MATCH(AT$13,INDIRECT($B$5&\"_key[RAMM field name]\"),0),1),INDIRECT($B$5&\"_\"&$C$5&\"[#Headers]\"),0))))","v":{"$error":"#N/A"}},{"$f":"IF(ISBLANK(INDEX(INDIRECT($B$5&\"_\"&$C$5),ROW()-13,MATCH(INDEX(INDIRECT($B$5&\"_key\"),MATCH(AU$13,INDIRECT($B$5&\"_key[RAMM field name]\"),0),1),INDIRECT($B$5&\"_\"&$C$5&\"[#Headers]\"),0))),\nIF(INDEX(INDIRECT($B$5&\"_key\"),MATCH(AU$13,INDIRECT($B$5&\"_key[RAMM field name]\"),0),6)=\"Y\",\"\"&INDEX(INDIRECT($B$5&\"_key\"),MATCH(AU$13,INDIRECT($B$5&\"_key[RAMM field name]\"),0),7),\"\"),\nIF(INDEX(INDIRECT($B$5&\"_key\"),MATCH(AU$13,INDIRECT($B$5&\"_key[RAMM field name]\"),0),3)=\"lookup\",\nINDEX(INDIRECT(INDEX(INDIRECT($B$5&\"_key\"),MATCH(AU$13,INDIRECT($B$5&\"_key[RAMM field name]\"),0),4)),\nMATCH(INDEX(INDIRECT($B$5&\"_\"&$C$5),ROW()-13,MATCH(INDEX(INDIRECT($B$5&\"_key\"),MATCH(AU$13,INDIRECT($B$5&\"_key[RAMM field name]\"),0),1),INDIRECT($B$5&\"_\"&$C$5&\"[#Headers]\"),0)),\nINDIRECT(INDEX(INDIRECT($B$5&\"_key\"),MATCH(AU$13,INDIRECT($B$5&\"_key[RAMM field name]\"),0),4)&\"[\"&INDEX(INDIRECT($B$5&\"_key\"),MATCH(AU$13,INDIRECT($B$5&\"_key[RAMM field name]\"),0),2)&\"]\"),0),1),\nINDEX(INDIRECT($B$5&\"_\"&$C$5),ROW()-13,MATCH(INDEX(INDIRECT($B$5&\"_key\"),MATCH(AU$13,INDIRECT($B$5&\"_key[RAMM field name]\"),0),1),INDIRECT($B$5&\"_\"&$C$5&\"[#Headers]\"),0))))","v":""},{"$f":"IF(ISBLANK(INDEX(INDIRECT($B$5&\"_\"&$C$5),ROW()-13,MATCH(INDEX(INDIRECT($B$5&\"_key\"),MATCH(AV$13,INDIRECT($B$5&\"_key[RAMM field name]\"),0),1),INDIRECT($B$5&\"_\"&$C$5&\"[#Headers]\"),0))),\nIF(INDEX(INDIRECT($B$5&\"_key\"),MATCH(AV$13,INDIRECT($B$5&\"_key[RAMM field name]\"),0),6)=\"Y\",\"\"&INDEX(INDIRECT($B$5&\"_key\"),MATCH(AV$13,INDIRECT($B$5&\"_key[RAMM field name]\"),0),7),\"\"),\nIF(INDEX(INDIRECT($B$5&\"_key\"),MATCH(AV$13,INDIRECT($B$5&\"_key[RAMM field name]\"),0),3)=\"lookup\",\nINDEX(INDIRECT(INDEX(INDIRECT($B$5&\"_key\"),MATCH(AV$13,INDIRECT($B$5&\"_key[RAMM field name]\"),0),4)),\nMATCH(INDEX(INDIRECT($B$5&\"_\"&$C$5),ROW()-13,MATCH(INDEX(INDIRECT($B$5&\"_key\"),MATCH(AV$13,INDIRECT($B$5&\"_key[RAMM field name]\"),0),1),INDIRECT($B$5&\"_\"&$C$5&\"[#Headers]\"),0)),\nINDIRECT(INDEX(INDIRECT($B$5&\"_key\"),MATCH(AV$13,INDIRECT($B$5&\"_key[RAMM field name]\"),0),4)&\"[\"&INDEX(INDIRECT($B$5&\"_key\"),MATCH(AV$13,INDIRECT($B$5&\"_key[RAMM field name]\"),0),2)&\"]\"),0),1),\nINDEX(INDIRECT($B$5&\"_\"&$C$5),ROW()-13,MATCH(INDEX(INDIRECT($B$5&\"_key\"),MATCH(AV$13,INDIRECT($B$5&\"_key[RAMM field name]\"),0),1),INDIRECT($B$5&\"_\"&$C$5&\"[#Headers]\"),0))))","v":""},{"$f":"IF(ISBLANK(INDEX(INDIRECT($B$5&\"_\"&$C$5),ROW()-13,MATCH(INDEX(INDIRECT($B$5&\"_key\"),MATCH(AW$13,INDIRECT($B$5&\"_key[RAMM field name]\"),0),1),INDIRECT($B$5&\"_\"&$C$5&\"[#Headers]\"),0))),\nIF(INDEX(INDIRECT($B$5&\"_key\"),MATCH(AW$13,INDIRECT($B$5&\"_key[RAMM field name]\"),0),6)=\"Y\",\"\"&INDEX(INDIRECT($B$5&\"_key\"),MATCH(AW$13,INDIRECT($B$5&\"_key[RAMM field name]\"),0),7),\"\"),\nIF(INDEX(INDIRECT($B$5&\"_key\"),MATCH(AW$13,INDIRECT($B$5&\"_key[RAMM field name]\"),0),3)=\"lookup\",\nINDEX(INDIRECT(INDEX(INDIRECT($B$5&\"_key\"),MATCH(AW$13,INDIRECT($B$5&\"_key[RAMM field name]\"),0),4)),\nMATCH(INDEX(INDIRECT($B$5&\"_\"&$C$5),ROW()-13,MATCH(INDEX(INDIRECT($B$5&\"_key\"),MATCH(AW$13,INDIRECT($B$5&\"_key[RAMM field name]\"),0),1),INDIRECT($B$5&\"_\"&$C$5&\"[#Headers]\"),0)),\nINDIRECT(INDEX(INDIRECT($B$5&\"_key\"),MATCH(AW$13,INDIRECT($B$5&\"_key[RAMM field name]\"),0),4)&\"[\"&INDEX(INDIRECT($B$5&\"_key\"),MATCH(AW$13,INDIRECT($B$5&\"_key[RAMM field name]\"),0),2)&\"]\"),0),1),\nINDEX(INDIRECT($B$5&\"_\"&$C$5),ROW()-13,MATCH(INDEX(INDIRECT($B$5&\"_key\"),MATCH(AW$13,INDIRECT($B$5&\"_key[RAMM field name]\"),0),1),INDIRECT($B$5&\"_\"&$C$5&\"[#Headers]\"),0))))","v":"U"},{"$f":"IF(ISBLANK(INDEX(INDIRECT($B$5&\"_\"&$C$5),ROW()-13,MATCH(INDEX(INDIRECT($B$5&\"_key\"),MATCH(AX$13,INDIRECT($B$5&\"_key[RAMM field name]\"),0),1),INDIRECT($B$5&\"_\"&$C$5&\"[#Headers]\"),0))),\nIF(INDEX(INDIRECT($B$5&\"_key\"),MATCH(AX$13,INDIRECT($B$5&\"_key[RAMM field name]\"),0),6)=\"Y\",\"\"&INDEX(INDIRECT($B$5&\"_key\"),MATCH(AX$13,INDIRECT($B$5&\"_key[RAMM field name]\"),0),7),\"\"),\nIF(INDEX(INDIRECT($B$5&\"_key\"),MATCH(AX$13,INDIRECT($B$5&\"_key[RAMM field name]\"),0),3)=\"lookup\",\nINDEX(INDIRECT(INDEX(INDIRECT($B$5&\"_key\"),MATCH(AX$13,INDIRECT($B$5&\"_key[RAMM field name]\"),0),4)),\nMATCH(INDEX(INDIRECT($B$5&\"_\"&$C$5),ROW()-13,MATCH(INDEX(INDIRECT($B$5&\"_key\"),MATCH(AX$13,INDIRECT($B$5&\"_key[RAMM field name]\"),0),1),INDIRECT($B$5&\"_\"&$C$5&\"[#Headers]\"),0)),\nINDIRECT(INDEX(INDIRECT($B$5&\"_key\"),MATCH(AX$13,INDIRECT($B$5&\"_key[RAMM field name]\"),0),4)&\"[\"&INDEX(INDIRECT($B$5&\"_key\"),MATCH(AX$13,INDIRECT($B$5&\"_key[RAMM field name]\"),0),2)&\"]\"),0),1),\nINDEX(INDIRECT($B$5&\"_\"&$C$5),ROW()-13,MATCH(INDEX(INDIRECT($B$5&\"_key\"),MATCH(AX$13,INDIRECT($B$5&\"_key[RAMM field name]\"),0),1),INDIRECT($B$5&\"_\"&$C$5&\"[#Headers]\"),0))))","v":"D"}]
[null,null,{"$f":"IF(ISBLANK(INDEX(INDIRECT($B$5&\"_\"&$C$5),ROW()-13,MATCH(INDEX(INDIRECT($B$5&\"_key\"),MATCH(C$13,INDIRECT($B$5&\"_key[RAMM field name]\"),0),1),INDIRECT($B$5&\"_\"&$C$5&\"[#Headers]\"),0))),\nIF(INDEX(INDIRECT($B$5&\"_key\"),MATCH(C$13,INDIRECT($B$5&\"_key[RAMM field name]\"),0),6)=\"Y\",\"\"&INDEX(INDIRECT($B$5&\"_key\"),MATCH(C$13,INDIRECT($B$5&\"_key[RAMM field name]\"),0),7),\"\"),\nIF(INDEX(INDIRECT($B$5&\"_key\"),MATCH(C$13,INDIRECT($B$5&\"_key[RAMM field name]\"),0),3)=\"lookup\",\nINDEX(INDIRECT(INDEX(INDIRECT($B$5&\"_key\"),MATCH(C$13,INDIRECT($B$5&\"_key[RAMM field name]\"),0),4)),\nMATCH(INDEX(INDIRECT($B$5&\"_\"&$C$5),ROW()-13,MATCH(INDEX(INDIRECT($B$5&\"_key\"),MATCH(C$13,INDIRECT($B$5&\"_key[RAMM field name]\"),0),1),INDIRECT($B$5&\"_\"&$C$5&\"[#Headers]\"),0)),\nINDIRECT(INDEX(INDIRECT($B$5&\"_key\"),MATCH(C$13,INDIRECT($B$5&\"_key[RAMM field name]\"),0),4)&\"[\"&INDEX(INDIRECT($B$5&\"_key\"),MATCH(C$13,INDIRECT($B$5&\"_key[RAMM field name]\"),0),2)&\"]\"),0),1),\nINDEX(INDIRECT($B$5&\"_\"&$C$5),ROW()-13,MATCH(INDEX(INDIRECT($B$5&\"_key\"),MATCH(C$13,INDIRECT($B$5&\"_key[RAMM field name]\"),0),1),INDIRECT($B$5&\"_\"&$C$5&\"[#Headers]\"),0))))","v":{"$error":"#REF!"}},{"$f":"IF(ISBLANK(INDEX(INDIRECT($B$5&\"_\"&$C$5),ROW()-13,MATCH(INDEX(INDIRECT($B$5&\"_key\"),MATCH(D$13,INDIRECT($B$5&\"_key[RAMM field name]\"),0),1),INDIRECT($B$5&\"_\"&$C$5&\"[#Headers]\"),0))),\nIF(INDEX(INDIRECT($B$5&\"_key\"),MATCH(D$13,INDIRECT($B$5&\"_key[RAMM field name]\"),0),6)=\"Y\",\"\"&INDEX(INDIRECT($B$5&\"_key\"),MATCH(D$13,INDIRECT($B$5&\"_key[RAMM field name]\"),0),7),\"\"),\nIF(INDEX(INDIRECT($B$5&\"_key\"),MATCH(D$13,INDIRECT($B$5&\"_key[RAMM field name]\"),0),3)=\"lookup\",\nINDEX(INDIRECT(INDEX(INDIRECT($B$5&\"_key\"),MATCH(D$13,INDIRECT($B$5&\"_key[RAMM field name]\"),0),4)),\nMATCH(INDEX(INDIRECT($B$5&\"_\"&$C$5),ROW()-13,MATCH(INDEX(INDIRECT($B$5&\"_key\"),MATCH(D$13,INDIRECT($B$5&\"_key[RAMM field name]\"),0),1),INDIRECT($B$5&\"_\"&$C$5&\"[#Headers]\"),0)),\nINDIRECT(INDEX(INDIRECT($B$5&\"_key\"),MATCH(D$13,INDIRECT($B$5&\"_key[RAMM field name]\"),0),4)&\"[\"&INDEX(INDIRECT($B$5&\"_key\"),MATCH(D$13,INDIRECT($B$5&\"_key[RAMM field name]\"),0),2)&\"]\"),0),1),\nINDEX(INDIRECT($B$5&\"_\"&$C$5),ROW()-13,MATCH(INDEX(INDIRECT($B$5&\"_key\"),MATCH(D$13,INDIRECT($B$5&\"_key[RAMM field name]\"),0),1),INDIRECT($B$5&\"_\"&$C$5&\"[#Headers]\"),0))))","v":{"$error":"#REF!"}},{"$f":"IF(ISBLANK(INDEX(INDIRECT($B$5&\"_\"&$C$5),ROW()-13,MATCH(INDEX(INDIRECT($B$5&\"_key\"),MATCH(E$13,INDIRECT($B$5&\"_key[RAMM field name]\"),0),1),INDIRECT($B$5&\"_\"&$C$5&\"[#Headers]\"),0))),\nIF(INDEX(INDIRECT($B$5&\"_key\"),MATCH(E$13,INDIRECT($B$5&\"_key[RAMM field name]\"),0),6)=\"Y\",\"\"&INDEX(INDIRECT($B$5&\"_key\"),MATCH(E$13,INDIRECT($B$5&\"_key[RAMM field name]\"),0),7),\"\"),\nIF(INDEX(INDIRECT($B$5&\"_key\"),MATCH(E$13,INDIRECT($B$5&\"_key[RAMM field name]\"),0),3)=\"lookup\",\nINDEX(INDIRECT(INDEX(INDIRECT($B$5&\"_key\"),MATCH(E$13,INDIRECT($B$5&\"_key[RAMM field name]\"),0),4)),\nMATCH(INDEX(INDIRECT($B$5&\"_\"&$C$5),ROW()-13,MATCH(INDEX(INDIRECT($B$5&\"_key\"),MATCH(E$13,INDIRECT($B$5&\"_key[RAMM field name]\"),0),1),INDIRECT($B$5&\"_\"&$C$5&\"[#Headers]\"),0)),\nINDIRECT(INDEX(INDIRECT($B$5&\"_key\"),MATCH(E$13,INDIRECT($B$5&\"_key[RAMM field name]\"),0),4)&\"[\"&INDEX(INDIRECT($B$5&\"_key\"),MATCH(E$13,INDIRECT($B$5&\"_key[RAMM field name]\"),0),2)&\"]\"),0),1),\nINDEX(INDIRECT($B$5&\"_\"&$C$5),ROW()-13,MATCH(INDEX(INDIRECT($B$5&\"_key\"),MATCH(E$13,INDIRECT($B$5&\"_key[RAMM field name]\"),0),1),INDIRECT($B$5&\"_\"&$C$5&\"[#Headers]\"),0))))","v":{"$error":"#REF!"}},{"$f":"IF(ISBLANK(INDEX(INDIRECT($B$5&\"_\"&$C$5),ROW()-13,MATCH(INDEX(INDIRECT($B$5&\"_key\"),MATCH(F$13,INDIRECT($B$5&\"_key[RAMM field name]\"),0),1),INDIRECT($B$5&\"_\"&$C$5&\"[#Headers]\"),0))),\nIF(INDEX(INDIRECT($B$5&\"_key\"),MATCH(F$13,INDIRECT($B$5&\"_key[RAMM field name]\"),0),6)=\"Y\",\"\"&INDEX(INDIRECT($B$5&\"_key\"),MATCH(F$13,INDIRECT($B$5&\"_key[RAMM field name]\"),0),7),\"\"),\nIF(INDEX(INDIRECT($B$5&\"_key\"),MATCH(F$13,INDIRECT($B$5&\"_key[RAMM field name]\"),0),3)=\"lookup\",\nINDEX(INDIRECT(INDEX(INDIRECT($B$5&\"_key\"),MATCH(F$13,INDIRECT($B$5&\"_key[RAMM field name]\"),0),4)),\nMATCH(INDEX(INDIRECT($B$5&\"_\"&$C$5),ROW()-13,MATCH(INDEX(INDIRECT($B$5&\"_key\"),MATCH(F$13,INDIRECT($B$5&\"_key[RAMM field name]\"),0),1),INDIRECT($B$5&\"_\"&$C$5&\"[#Headers]\"),0)),\nINDIRECT(INDEX(INDIRECT($B$5&\"_key\"),MATCH(F$13,INDIRECT($B$5&\"_key[RAMM field name]\"),0),4)&\"[\"&INDEX(INDIRECT($B$5&\"_key\"),MATCH(F$13,INDIRECT($B$5&\"_key[RAMM field name]\"),0),2)&\"]\"),0),1),\nINDEX(INDIRECT($B$5&\"_\"&$C$5),ROW()-13,MATCH(INDEX(INDIRECT($B$5&\"_key\"),MATCH(F$13,INDIRECT($B$5&\"_key[RAMM field name]\"),0),1),INDIRECT($B$5&\"_\"&$C$5&\"[#Headers]\"),0))))","v":{"$error":"#N/A"}},{"$f":"IF(ISBLANK(INDEX(INDIRECT($B$5&\"_\"&$C$5),ROW()-13,MATCH(INDEX(INDIRECT($B$5&\"_key\"),MATCH(G$13,INDIRECT($B$5&\"_key[RAMM field name]\"),0),1),INDIRECT($B$5&\"_\"&$C$5&\"[#Headers]\"),0))),\nIF(INDEX(INDIRECT($B$5&\"_key\"),MATCH(G$13,INDIRECT($B$5&\"_key[RAMM field name]\"),0),6)=\"Y\",\"\"&INDEX(INDIRECT($B$5&\"_key\"),MATCH(G$13,INDIRECT($B$5&\"_key[RAMM field name]\"),0),7),\"\"),\nIF(INDEX(INDIRECT($B$5&\"_key\"),MATCH(G$13,INDIRECT($B$5&\"_key[RAMM field name]\"),0),3)=\"lookup\",\nINDEX(INDIRECT(INDEX(INDIRECT($B$5&\"_key\"),MATCH(G$13,INDIRECT($B$5&\"_key[RAMM field name]\"),0),4)),\nMATCH(INDEX(INDIRECT($B$5&\"_\"&$C$5),ROW()-13,MATCH(INDEX(INDIRECT($B$5&\"_key\"),MATCH(G$13,INDIRECT($B$5&\"_key[RAMM field name]\"),0),1),INDIRECT($B$5&\"_\"&$C$5&\"[#Headers]\"),0)),\nINDIRECT(INDEX(INDIRECT($B$5&\"_key\"),MATCH(G$13,INDIRECT($B$5&\"_key[RAMM field name]\"),0),4)&\"[\"&INDEX(INDIRECT($B$5&\"_key\"),MATCH(G$13,INDIRECT($B$5&\"_key[RAMM field name]\"),0),2)&\"]\"),0),1),\nINDEX(INDIRECT($B$5&\"_\"&$C$5),ROW()-13,MATCH(INDEX(INDIRECT($B$5&\"_key\"),MATCH(G$13,INDIRECT($B$5&\"_key[RAMM field name]\"),0),1),INDIRECT($B$5&\"_\"&$C$5&\"[#Headers]\"),0))))","v":{"$error":"#N/A"}},{"$f":"IF(ISBLANK(INDEX(INDIRECT($B$5&\"_\"&$C$5),ROW()-13,MATCH(INDEX(INDIRECT($B$5&\"_key\"),MATCH(H$13,INDIRECT($B$5&\"_key[RAMM field name]\"),0),1),INDIRECT($B$5&\"_\"&$C$5&\"[#Headers]\"),0))),\nIF(INDEX(INDIRECT($B$5&\"_key\"),MATCH(H$13,INDIRECT($B$5&\"_key[RAMM field name]\"),0),6)=\"Y\",\"\"&INDEX(INDIRECT($B$5&\"_key\"),MATCH(H$13,INDIRECT($B$5&\"_key[RAMM field name]\"),0),7),\"\"),\nIF(INDEX(INDIRECT($B$5&\"_key\"),MATCH(H$13,INDIRECT($B$5&\"_key[RAMM field name]\"),0),3)=\"lookup\",\nINDEX(INDIRECT(INDEX(INDIRECT($B$5&\"_key\"),MATCH(H$13,INDIRECT($B$5&\"_key[RAMM field name]\"),0),4)),\nMATCH(INDEX(INDIRECT($B$5&\"_\"&$C$5),ROW()-13,MATCH(INDEX(INDIRECT($B$5&\"_key\"),MATCH(H$13,INDIRECT($B$5&\"_key[RAMM field name]\"),0),1),INDIRECT($B$5&\"_\"&$C$5&\"[#Headers]\"),0)),\nINDIRECT(INDEX(INDIRECT($B$5&\"_key\"),MATCH(H$13,INDIRECT($B$5&\"_key[RAMM field name]\"),0),4)&\"[\"&INDEX(INDIRECT($B$5&\"_key\"),MATCH(H$13,INDIRECT($B$5&\"_key[RAMM field name]\"),0),2)&\"]\"),0),1),\nINDEX(INDIRECT($B$5&\"_\"&$C$5),ROW()-13,MATCH(INDEX(INDIRECT($B$5&\"_key\"),MATCH(H$13,INDIRECT($B$5&\"_key[RAMM field name]\"),0),1),INDIRECT($B$5&\"_\"&$C$5&\"[#Headers]\"),0))))","v":{"$error":"#N/A"}},{"$f":"IF(ISBLANK(INDEX(INDIRECT($B$5&\"_\"&$C$5),ROW()-13,MATCH(INDEX(INDIRECT($B$5&\"_key\"),MATCH(I$13,INDIRECT($B$5&\"_key[RAMM field name]\"),0),1),INDIRECT($B$5&\"_\"&$C$5&\"[#Headers]\"),0))),\nIF(INDEX(INDIRECT($B$5&\"_key\"),MATCH(I$13,INDIRECT($B$5&\"_key[RAMM field name]\"),0),6)=\"Y\",\"\"&INDEX(INDIRECT($B$5&\"_key\"),MATCH(I$13,INDIRECT($B$5&\"_key[RAMM field name]\"),0),7),\"\"),\nIF(INDEX(INDIRECT($B$5&\"_key\"),MATCH(I$13,INDIRECT($B$5&\"_key[RAMM field name]\"),0),3)=\"lookup\",\nINDEX(INDIRECT(INDEX(INDIRECT($B$5&\"_key\"),MATCH(I$13,INDIRECT($B$5&\"_key[RAMM field name]\"),0),4)),\nMATCH(INDEX(INDIRECT($B$5&\"_\"&$C$5),ROW()-13,MATCH(INDEX(INDIRECT($B$5&\"_key\"),MATCH(I$13,INDIRECT($B$5&\"_key[RAMM field name]\"),0),1),INDIRECT($B$5&\"_\"&$C$5&\"[#Headers]\"),0)),\nINDIRECT(INDEX(INDIRECT($B$5&\"_key\"),MATCH(I$13,INDIRECT($B$5&\"_key[RAMM field name]\"),0),4)&\"[\"&INDEX(INDIRECT($B$5&\"_key\"),MATCH(I$13,INDIRECT($B$5&\"_key[RAMM field name]\"),0),2)&\"]\"),0),1),\nINDEX(INDIRECT($B$5&\"_\"&$C$5),ROW()-13,MATCH(INDEX(INDIRECT($B$5&\"_key\"),MATCH(I$13,INDIRECT($B$5&\"_key[RAMM field name]\"),0),1),INDIRECT($B$5&\"_\"&$C$5&\"[#Headers]\"),0))))","v":{"$error":"#N/A"}},{"$f":"IF(ISBLANK(INDEX(INDIRECT($B$5&\"_\"&$C$5),ROW()-13,MATCH(INDEX(INDIRECT($B$5&\"_key\"),MATCH(J$13,INDIRECT($B$5&\"_key[RAMM field name]\"),0),1),INDIRECT($B$5&\"_\"&$C$5&\"[#Headers]\"),0))),\nIF(INDEX(INDIRECT($B$5&\"_key\"),MATCH(J$13,INDIRECT($B$5&\"_key[RAMM field name]\"),0),6)=\"Y\",\"\"&INDEX(INDIRECT($B$5&\"_key\"),MATCH(J$13,INDIRECT($B$5&\"_key[RAMM field name]\"),0),7),\"\"),\nIF(INDEX(INDIRECT($B$5&\"_key\"),MATCH(J$13,INDIRECT($B$5&\"_key[RAMM field name]\"),0),3)=\"lookup\",\nINDEX(INDIRECT(INDEX(INDIRECT($B$5&\"_key\"),MATCH(J$13,INDIRECT($B$5&\"_key[RAMM field name]\"),0),4)),\nMATCH(INDEX(INDIRECT($B$5&\"_\"&$C$5),ROW()-13,MATCH(INDEX(INDIRECT($B$5&\"_key\"),MATCH(J$13,INDIRECT($B$5&\"_key[RAMM field name]\"),0),1),INDIRECT($B$5&\"_\"&$C$5&\"[#Headers]\"),0)),\nINDIRECT(INDEX(INDIRECT($B$5&\"_key\"),MATCH(J$13,INDIRECT($B$5&\"_key[RAMM field name]\"),0),4)&\"[\"&INDEX(INDIRECT($B$5&\"_key\"),MATCH(J$13,INDIRECT($B$5&\"_key[RAMM field name]\"),0),2)&\"]\"),0),1),\nINDEX(INDIRECT($B$5&\"_\"&$C$5),ROW()-13,MATCH(INDEX(INDIRECT($B$5&\"_key\"),MATCH(J$13,INDIRECT($B$5&\"_key[RAMM field name]\"),0),1),INDIRECT($B$5&\"_\"&$C$5&\"[#Headers]\"),0))))","v":{"$error":"#N/A"}},{"$f":"IF(ISBLANK(INDEX(INDIRECT($B$5&\"_\"&$C$5),ROW()-13,MATCH(INDEX(INDIRECT($B$5&\"_key\"),MATCH(K$13,INDIRECT($B$5&\"_key[RAMM field name]\"),0),1),INDIRECT($B$5&\"_\"&$C$5&\"[#Headers]\"),0))),\nIF(INDEX(INDIRECT($B$5&\"_key\"),MATCH(K$13,INDIRECT($B$5&\"_key[RAMM field name]\"),0),6)=\"Y\",\"\"&INDEX(INDIRECT($B$5&\"_key\"),MATCH(K$13,INDIRECT($B$5&\"_key[RAMM field name]\"),0),7),\"\"),\nIF(INDEX(INDIRECT($B$5&\"_key\"),MATCH(K$13,INDIRECT($B$5&\"_key[RAMM field name]\"),0),3)=\"lookup\",\nINDEX(INDIRECT(INDEX(INDIRECT($B$5&\"_key\"),MATCH(K$13,INDIRECT($B$5&\"_key[RAMM field name]\"),0),4)),\nMATCH(INDEX(INDIRECT($B$5&\"_\"&$C$5),ROW()-13,MATCH(INDEX(INDIRECT($B$5&\"_key\"),MATCH(K$13,INDIRECT($B$5&\"_key[RAMM field name]\"),0),1),INDIRECT($B$5&\"_\"&$C$5&\"[#Headers]\"),0)),\nINDIRECT(INDEX(INDIRECT($B$5&\"_key\"),MATCH(K$13,INDIRECT($B$5&\"_key[RAMM field name]\"),0),4)&\"[\"&INDEX(INDIRECT($B$5&\"_key\"),MATCH(K$13,INDIRECT($B$5&\"_key[RAMM field name]\"),0),2)&\"]\"),0),1),\nINDEX(INDIRECT($B$5&\"_\"&$C$5),ROW()-13,MATCH(INDEX(INDIRECT($B$5&\"_key\"),MATCH(K$13,INDIRECT($B$5&\"_key[RAMM field name]\"),0),1),INDIRECT($B$5&\"_\"&$C$5&\"[#Headers]\"),0))))","v":{"$error":"#N/A"}},{"$f":"IF(ISBLANK(INDEX(INDIRECT($B$5&\"_\"&$C$5),ROW()-13,MATCH(INDEX(INDIRECT($B$5&\"_key\"),MATCH(L$13,INDIRECT($B$5&\"_key[RAMM field name]\"),0),1),INDIRECT($B$5&\"_\"&$C$5&\"[#Headers]\"),0))),\nIF(INDEX(INDIRECT($B$5&\"_key\"),MATCH(L$13,INDIRECT($B$5&\"_key[RAMM field name]\"),0),6)=\"Y\",\"\"&INDEX(INDIRECT($B$5&\"_key\"),MATCH(L$13,INDIRECT($B$5&\"_key[RAMM field name]\"),0),7),\"\"),\nIF(INDEX(INDIRECT($B$5&\"_key\"),MATCH(L$13,INDIRECT($B$5&\"_key[RAMM field name]\"),0),3)=\"lookup\",\nINDEX(INDIRECT(INDEX(INDIRECT($B$5&\"_key\"),MATCH(L$13,INDIRECT($B$5&\"_key[RAMM field name]\"),0),4)),\nMATCH(INDEX(INDIRECT($B$5&\"_\"&$C$5),ROW()-13,MATCH(INDEX(INDIRECT($B$5&\"_key\"),MATCH(L$13,INDIRECT($B$5&\"_key[RAMM field name]\"),0),1),INDIRECT($B$5&\"_\"&$C$5&\"[#Headers]\"),0)),\nINDIRECT(INDEX(INDIRECT($B$5&\"_key\"),MATCH(L$13,INDIRECT($B$5&\"_key[RAMM field name]\"),0),4)&\"[\"&INDEX(INDIRECT($B$5&\"_key\"),MATCH(L$13,INDIRECT($B$5&\"_key[RAMM field name]\"),0),2)&\"]\"),0),1),\nINDEX(INDIRECT($B$5&\"_\"&$C$5),ROW()-13,MATCH(INDEX(INDIRECT($B$5&\"_key\"),MATCH(L$13,INDIRECT($B$5&\"_key[RAMM field name]\"),0),1),INDIRECT($B$5&\"_\"&$C$5&\"[#Headers]\"),0))))","v":{"$error":"#N/A"}},{"$f":"IF(ISBLANK(INDEX(INDIRECT($B$5&\"_\"&$C$5),ROW()-13,MATCH(INDEX(INDIRECT($B$5&\"_key\"),MATCH(M$13,INDIRECT($B$5&\"_key[RAMM field name]\"),0),1),INDIRECT($B$5&\"_\"&$C$5&\"[#Headers]\"),0))),\nIF(INDEX(INDIRECT($B$5&\"_key\"),MATCH(M$13,INDIRECT($B$5&\"_key[RAMM field name]\"),0),6)=\"Y\",\"\"&INDEX(INDIRECT($B$5&\"_key\"),MATCH(M$13,INDIRECT($B$5&\"_key[RAMM field name]\"),0),7),\"\"),\nIF(INDEX(INDIRECT($B$5&\"_key\"),MATCH(M$13,INDIRECT($B$5&\"_key[RAMM field name]\"),0),3)=\"lookup\",\nINDEX(INDIRECT(INDEX(INDIRECT($B$5&\"_key\"),MATCH(M$13,INDIRECT($B$5&\"_key[RAMM field name]\"),0),4)),\nMATCH(INDEX(INDIRECT($B$5&\"_\"&$C$5),ROW()-13,MATCH(INDEX(INDIRECT($B$5&\"_key\"),MATCH(M$13,INDIRECT($B$5&\"_key[RAMM field name]\"),0),1),INDIRECT($B$5&\"_\"&$C$5&\"[#Headers]\"),0)),\nINDIRECT(INDEX(INDIRECT($B$5&\"_key\"),MATCH(M$13,INDIRECT($B$5&\"_key[RAMM field name]\"),0),4)&\"[\"&INDEX(INDIRECT($B$5&\"_key\"),MATCH(M$13,INDIRECT($B$5&\"_key[RAMM field name]\"),0),2)&\"]\"),0),1),\nINDEX(INDIRECT($B$5&\"_\"&$C$5),ROW()-13,MATCH(INDEX(INDIRECT($B$5&\"_key\"),MATCH(M$13,INDIRECT($B$5&\"_key[RAMM field name]\"),0),1),INDIRECT($B$5&\"_\"&$C$5&\"[#Headers]\"),0))))","v":{"$error":"#N/A"}},{"$f":"IF(ISBLANK(INDEX(INDIRECT($B$5&\"_\"&$C$5),ROW()-13,MATCH(INDEX(INDIRECT($B$5&\"_key\"),MATCH(N$13,INDIRECT($B$5&\"_key[RAMM field name]\"),0),1),INDIRECT($B$5&\"_\"&$C$5&\"[#Headers]\"),0))),\nIF(INDEX(INDIRECT($B$5&\"_key\"),MATCH(N$13,INDIRECT($B$5&\"_key[RAMM field name]\"),0),6)=\"Y\",\"\"&INDEX(INDIRECT($B$5&\"_key\"),MATCH(N$13,INDIRECT($B$5&\"_key[RAMM field name]\"),0),7),\"\"),\nIF(INDEX(INDIRECT($B$5&\"_key\"),MATCH(N$13,INDIRECT($B$5&\"_key[RAMM field name]\"),0),3)=\"lookup\",\nINDEX(INDIRECT(INDEX(INDIRECT($B$5&\"_key\"),MATCH(N$13,INDIRECT($B$5&\"_key[RAMM field name]\"),0),4)),\nMATCH(INDEX(INDIRECT($B$5&\"_\"&$C$5),ROW()-13,MATCH(INDEX(INDIRECT($B$5&\"_key\"),MATCH(N$13,INDIRECT($B$5&\"_key[RAMM field name]\"),0),1),INDIRECT($B$5&\"_\"&$C$5&\"[#Headers]\"),0)),\nINDIRECT(INDEX(INDIRECT($B$5&\"_key\"),MATCH(N$13,INDIRECT($B$5&\"_key[RAMM field name]\"),0),4)&\"[\"&INDEX(INDIRECT($B$5&\"_key\"),MATCH(N$13,INDIRECT($B$5&\"_key[RAMM field name]\"),0),2)&\"]\"),0),1),\nINDEX(INDIRECT($B$5&\"_\"&$C$5),ROW()-13,MATCH(INDEX(INDIRECT($B$5&\"_key\"),MATCH(N$13,INDIRECT($B$5&\"_key[RAMM field name]\"),0),1),INDIRECT($B$5&\"_\"&$C$5&\"[#Headers]\"),0))))","v":{"$error":"#N/A"}},{"$f":"IF(ISBLANK(INDEX(INDIRECT($B$5&\"_\"&$C$5),ROW()-13,MATCH(INDEX(INDIRECT($B$5&\"_key\"),MATCH(O$13,INDIRECT($B$5&\"_key[RAMM field name]\"),0),1),INDIRECT($B$5&\"_\"&$C$5&\"[#Headers]\"),0))),\nIF(INDEX(INDIRECT($B$5&\"_key\"),MATCH(O$13,INDIRECT($B$5&\"_key[RAMM field name]\"),0),6)=\"Y\",\"\"&INDEX(INDIRECT($B$5&\"_key\"),MATCH(O$13,INDIRECT($B$5&\"_key[RAMM field name]\"),0),7),\"\"),\nIF(INDEX(INDIRECT($B$5&\"_key\"),MATCH(O$13,INDIRECT($B$5&\"_key[RAMM field name]\"),0),3)=\"lookup\",\nINDEX(INDIRECT(INDEX(INDIRECT($B$5&\"_key\"),MATCH(O$13,INDIRECT($B$5&\"_key[RAMM field name]\"),0),4)),\nMATCH(INDEX(INDIRECT($B$5&\"_\"&$C$5),ROW()-13,MATCH(INDEX(INDIRECT($B$5&\"_key\"),MATCH(O$13,INDIRECT($B$5&\"_key[RAMM field name]\"),0),1),INDIRECT($B$5&\"_\"&$C$5&\"[#Headers]\"),0)),\nINDIRECT(INDEX(INDIRECT($B$5&\"_key\"),MATCH(O$13,INDIRECT($B$5&\"_key[RAMM field name]\"),0),4)&\"[\"&INDEX(INDIRECT($B$5&\"_key\"),MATCH(O$13,INDIRECT($B$5&\"_key[RAMM field name]\"),0),2)&\"]\"),0),1),\nINDEX(INDIRECT($B$5&\"_\"&$C$5),ROW()-13,MATCH(INDEX(INDIRECT($B$5&\"_key\"),MATCH(O$13,INDIRECT($B$5&\"_key[RAMM field name]\"),0),1),INDIRECT($B$5&\"_\"&$C$5&\"[#Headers]\"),0))))","v":{"$error":"#N/A"}},{"$f":"IF(ISBLANK(INDEX(INDIRECT($B$5&\"_\"&$C$5),ROW()-13,MATCH(INDEX(INDIRECT($B$5&\"_key\"),MATCH(P$13,INDIRECT($B$5&\"_key[RAMM field name]\"),0),1),INDIRECT($B$5&\"_\"&$C$5&\"[#Headers]\"),0))),\nIF(INDEX(INDIRECT($B$5&\"_key\"),MATCH(P$13,INDIRECT($B$5&\"_key[RAMM field name]\"),0),6)=\"Y\",\"\"&INDEX(INDIRECT($B$5&\"_key\"),MATCH(P$13,INDIRECT($B$5&\"_key[RAMM field name]\"),0),7),\"\"),\nIF(INDEX(INDIRECT($B$5&\"_key\"),MATCH(P$13,INDIRECT($B$5&\"_key[RAMM field name]\"),0),3)=\"lookup\",\nINDEX(INDIRECT(INDEX(INDIRECT($B$5&\"_key\"),MATCH(P$13,INDIRECT($B$5&\"_key[RAMM field name]\"),0),4)),\nMATCH(INDEX(INDIRECT($B$5&\"_\"&$C$5),ROW()-13,MATCH(INDEX(INDIRECT($B$5&\"_key\"),MATCH(P$13,INDIRECT($B$5&\"_key[RAMM field name]\"),0),1),INDIRECT($B$5&\"_\"&$C$5&\"[#Headers]\"),0)),\nINDIRECT(INDEX(INDIRECT($B$5&\"_key\"),MATCH(P$13,INDIRECT($B$5&\"_key[RAMM field name]\"),0),4)&\"[\"&INDEX(INDIRECT($B$5&\"_key\"),MATCH(P$13,INDIRECT($B$5&\"_key[RAMM field name]\"),0),2)&\"]\"),0),1),\nINDEX(INDIRECT($B$5&\"_\"&$C$5),ROW()-13,MATCH(INDEX(INDIRECT($B$5&\"_key\"),MATCH(P$13,INDIRECT($B$5&\"_key[RAMM field name]\"),0),1),INDIRECT($B$5&\"_\"&$C$5&\"[#Headers]\"),0))))","v":{"$error":"#N/A"}},{"$f":"IF(ISBLANK(INDEX(INDIRECT($B$5&\"_\"&$C$5),ROW()-13,MATCH(INDEX(INDIRECT($B$5&\"_key\"),MATCH(Q$13,INDIRECT($B$5&\"_key[RAMM field name]\"),0),1),INDIRECT($B$5&\"_\"&$C$5&\"[#Headers]\"),0))),\nIF(INDEX(INDIRECT($B$5&\"_key\"),MATCH(Q$13,INDIRECT($B$5&\"_key[RAMM field name]\"),0),6)=\"Y\",\"\"&INDEX(INDIRECT($B$5&\"_key\"),MATCH(Q$13,INDIRECT($B$5&\"_key[RAMM field name]\"),0),7),\"\"),\nIF(INDEX(INDIRECT($B$5&\"_key\"),MATCH(Q$13,INDIRECT($B$5&\"_key[RAMM field name]\"),0),3)=\"lookup\",\nINDEX(INDIRECT(INDEX(INDIRECT($B$5&\"_key\"),MATCH(Q$13,INDIRECT($B$5&\"_key[RAMM field name]\"),0),4)),\nMATCH(INDEX(INDIRECT($B$5&\"_\"&$C$5),ROW()-13,MATCH(INDEX(INDIRECT($B$5&\"_key\"),MATCH(Q$13,INDIRECT($B$5&\"_key[RAMM field name]\"),0),1),INDIRECT($B$5&\"_\"&$C$5&\"[#Headers]\"),0)),\nINDIRECT(INDEX(INDIRECT($B$5&\"_key\"),MATCH(Q$13,INDIRECT($B$5&\"_key[RAMM field name]\"),0),4)&\"[\"&INDEX(INDIRECT($B$5&\"_key\"),MATCH(Q$13,INDIRECT($B$5&\"_key[RAMM field name]\"),0),2)&\"]\"),0),1),\nINDEX(INDIRECT($B$5&\"_\"&$C$5),ROW()-13,MATCH(INDEX(INDIRECT($B$5&\"_key\"),MATCH(Q$13,INDIRECT($B$5&\"_key[RAMM field name]\"),0),1),INDIRECT($B$5&\"_\"&$C$5&\"[#Headers]\"),0))))","v":{"$error":"#N/A"}},{"$f":"IF(ISBLANK(INDEX(INDIRECT($B$5&\"_\"&$C$5),ROW()-13,MATCH(INDEX(INDIRECT($B$5&\"_key\"),MATCH(R$13,INDIRECT($B$5&\"_key[RAMM field name]\"),0),1),INDIRECT($B$5&\"_\"&$C$5&\"[#Headers]\"),0))),\nIF(INDEX(INDIRECT($B$5&\"_key\"),MATCH(R$13,INDIRECT($B$5&\"_key[RAMM field name]\"),0),6)=\"Y\",\"\"&INDEX(INDIRECT($B$5&\"_key\"),MATCH(R$13,INDIRECT($B$5&\"_key[RAMM field name]\"),0),7),\"\"),\nIF(INDEX(INDIRECT($B$5&\"_key\"),MATCH(R$13,INDIRECT($B$5&\"_key[RAMM field name]\"),0),3)=\"lookup\",\nINDEX(INDIRECT(INDEX(INDIRECT($B$5&\"_key\"),MATCH(R$13,INDIRECT($B$5&\"_key[RAMM field name]\"),0),4)),\nMATCH(INDEX(INDIRECT($B$5&\"_\"&$C$5),ROW()-13,MATCH(INDEX(INDIRECT($B$5&\"_key\"),MATCH(R$13,INDIRECT($B$5&\"_key[RAMM field name]\"),0),1),INDIRECT($B$5&\"_\"&$C$5&\"[#Headers]\"),0)),\nINDIRECT(INDEX(INDIRECT($B$5&\"_key\"),MATCH(R$13,INDIRECT($B$5&\"_key[RAMM field name]\"),0),4)&\"[\"&INDEX(INDIRECT($B$5&\"_key\"),MATCH(R$13,INDIRECT($B$5&\"_key[RAMM field name]\"),0),2)&\"]\"),0),1),\nINDEX(INDIRECT($B$5&\"_\"&$C$5),ROW()-13,MATCH(INDEX(INDIRECT($B$5&\"_key\"),MATCH(R$13,INDIRECT($B$5&\"_key[RAMM field name]\"),0),1),INDIRECT($B$5&\"_\"&$C$5&\"[#Headers]\"),0))))","v":{"$error":"#N/A"}},{"$f":"IF(ISBLANK(INDEX(INDIRECT($B$5&\"_\"&$C$5),ROW()-13,MATCH(INDEX(INDIRECT($B$5&\"_key\"),MATCH(S$13,INDIRECT($B$5&\"_key[RAMM field name]\"),0),1),INDIRECT($B$5&\"_\"&$C$5&\"[#Headers]\"),0))),\nIF(INDEX(INDIRECT($B$5&\"_key\"),MATCH(S$13,INDIRECT($B$5&\"_key[RAMM field name]\"),0),6)=\"Y\",\"\"&INDEX(INDIRECT($B$5&\"_key\"),MATCH(S$13,INDIRECT($B$5&\"_key[RAMM field name]\"),0),7),\"\"),\nIF(INDEX(INDIRECT($B$5&\"_key\"),MATCH(S$13,INDIRECT($B$5&\"_key[RAMM field name]\"),0),3)=\"lookup\",\nINDEX(INDIRECT(INDEX(INDIRECT($B$5&\"_key\"),MATCH(S$13,INDIRECT($B$5&\"_key[RAMM field name]\"),0),4)),\nMATCH(INDEX(INDIRECT($B$5&\"_\"&$C$5),ROW()-13,MATCH(INDEX(INDIRECT($B$5&\"_key\"),MATCH(S$13,INDIRECT($B$5&\"_key[RAMM field name]\"),0),1),INDIRECT($B$5&\"_\"&$C$5&\"[#Headers]\"),0)),\nINDIRECT(INDEX(INDIRECT($B$5&\"_key\"),MATCH(S$13,INDIRECT($B$5&\"_key[RAMM field name]\"),0),4)&\"[\"&INDEX(INDIRECT($B$5&\"_key\"),MATCH(S$13,INDIRECT($B$5&\"_key[RAMM field name]\"),0),2)&\"]\"),0),1),\nINDEX(INDIRECT($B$5&\"_\"&$C$5),ROW()-13,MATCH(INDEX(INDIRECT($B$5&\"_key\"),MATCH(S$13,INDIRECT($B$5&\"_key[RAMM field name]\"),0),1),INDIRECT($B$5&\"_\"&$C$5&\"[#Headers]\"),0))))","v":{"$error":"#N/A"}},{"$f":"IF(ISBLANK(INDEX(INDIRECT($B$5&\"_\"&$C$5),ROW()-13,MATCH(INDEX(INDIRECT($B$5&\"_key\"),MATCH(T$13,INDIRECT($B$5&\"_key[RAMM field name]\"),0),1),INDIRECT($B$5&\"_\"&$C$5&\"[#Headers]\"),0))),\nIF(INDEX(INDIRECT($B$5&\"_key\"),MATCH(T$13,INDIRECT($B$5&\"_key[RAMM field name]\"),0),6)=\"Y\",\"\"&INDEX(INDIRECT($B$5&\"_key\"),MATCH(T$13,INDIRECT($B$5&\"_key[RAMM field name]\"),0),7),\"\"),\nIF(INDEX(INDIRECT($B$5&\"_key\"),MATCH(T$13,INDIRECT($B$5&\"_key[RAMM field name]\"),0),3)=\"lookup\",\nINDEX(INDIRECT(INDEX(INDIRECT($B$5&\"_key\"),MATCH(T$13,INDIRECT($B$5&\"_key[RAMM field name]\"),0),4)),\nMATCH(INDEX(INDIRECT($B$5&\"_\"&$C$5),ROW()-13,MATCH(INDEX(INDIRECT($B$5&\"_key\"),MATCH(T$13,INDIRECT($B$5&\"_key[RAMM field name]\"),0),1),INDIRECT($B$5&\"_\"&$C$5&\"[#Headers]\"),0)),\nINDIRECT(INDEX(INDIRECT($B$5&\"_key\"),MATCH(T$13,INDIRECT($B$5&\"_key[RAMM field name]\"),0),4)&\"[\"&INDEX(INDIRECT($B$5&\"_key\"),MATCH(T$13,INDIRECT($B$5&\"_key[RAMM field name]\"),0),2)&\"]\"),0),1),\nINDEX(INDIRECT($B$5&\"_\"&$C$5),ROW()-13,MATCH(INDEX(INDIRECT($B$5&\"_key\"),MATCH(T$13,INDIRECT($B$5&\"_key[RAMM field name]\"),0),1),INDIRECT($B$5&\"_\"&$C$5&\"[#Headers]\"),0))))","v":{"$error":"#N/A"}},{"$f":"IF(ISBLANK(INDEX(INDIRECT($B$5&\"_\"&$C$5),ROW()-13,MATCH(INDEX(INDIRECT($B$5&\"_key\"),MATCH(U$13,INDIRECT($B$5&\"_key[RAMM field name]\"),0),1),INDIRECT($B$5&\"_\"&$C$5&\"[#Headers]\"),0))),\nIF(INDEX(INDIRECT($B$5&\"_key\"),MATCH(U$13,INDIRECT($B$5&\"_key[RAMM field name]\"),0),6)=\"Y\",\"\"&INDEX(INDIRECT($B$5&\"_key\"),MATCH(U$13,INDIRECT($B$5&\"_key[RAMM field name]\"),0),7),\"\"),\nIF(INDEX(INDIRECT($B$5&\"_key\"),MATCH(U$13,INDIRECT($B$5&\"_key[RAMM field name]\"),0),3)=\"lookup\",\nINDEX(INDIRECT(INDEX(INDIRECT($B$5&\"_key\"),MATCH(U$13,INDIRECT($B$5&\"_key[RAMM field name]\"),0),4)),\nMATCH(INDEX(INDIRECT($B$5&\"_\"&$C$5),ROW()-13,MATCH(INDEX(INDIRECT($B$5&\"_key\"),MATCH(U$13,INDIRECT($B$5&\"_key[RAMM field name]\"),0),1),INDIRECT($B$5&\"_\"&$C$5&\"[#Headers]\"),0)),\nINDIRECT(INDEX(INDIRECT($B$5&\"_key\"),MATCH(U$13,INDIRECT($B$5&\"_key[RAMM field name]\"),0),4)&\"[\"&INDEX(INDIRECT($B$5&\"_key\"),MATCH(U$13,INDIRECT($B$5&\"_key[RAMM field name]\"),0),2)&\"]\"),0),1),\nINDEX(INDIRECT($B$5&\"_\"&$C$5),ROW()-13,MATCH(INDEX(INDIRECT($B$5&\"_key\"),MATCH(U$13,INDIRECT($B$5&\"_key[RAMM field name]\"),0),1),INDIRECT($B$5&\"_\"&$C$5&\"[#Headers]\"),0))))","v":{"$error":"#N/A"}},{"$f":"IF(ISBLANK(INDEX(INDIRECT($B$5&\"_\"&$C$5),ROW()-13,MATCH(INDEX(INDIRECT($B$5&\"_key\"),MATCH(V$13,INDIRECT($B$5&\"_key[RAMM field name]\"),0),1),INDIRECT($B$5&\"_\"&$C$5&\"[#Headers]\"),0))),\nIF(INDEX(INDIRECT($B$5&\"_key\"),MATCH(V$13,INDIRECT($B$5&\"_key[RAMM field name]\"),0),6)=\"Y\",\"\"&INDEX(INDIRECT($B$5&\"_key\"),MATCH(V$13,INDIRECT($B$5&\"_key[RAMM field name]\"),0),7),\"\"),\nIF(INDEX(INDIRECT($B$5&\"_key\"),MATCH(V$13,INDIRECT($B$5&\"_key[RAMM field name]\"),0),3)=\"lookup\",\nINDEX(INDIRECT(INDEX(INDIRECT($B$5&\"_key\"),MATCH(V$13,INDIRECT($B$5&\"_key[RAMM field name]\"),0),4)),\nMATCH(INDEX(INDIRECT($B$5&\"_\"&$C$5),ROW()-13,MATCH(INDEX(INDIRECT($B$5&\"_key\"),MATCH(V$13,INDIRECT($B$5&\"_key[RAMM field name]\"),0),1),INDIRECT($B$5&\"_\"&$C$5&\"[#Headers]\"),0)),\nINDIRECT(INDEX(INDIRECT($B$5&\"_key\"),MATCH(V$13,INDIRECT($B$5&\"_key[RAMM field name]\"),0),4)&\"[\"&INDEX(INDIRECT($B$5&\"_key\"),MATCH(V$13,INDIRECT($B$5&\"_key[RAMM field name]\"),0),2)&\"]\"),0),1),\nINDEX(INDIRECT($B$5&\"_\"&$C$5),ROW()-13,MATCH(INDEX(INDIRECT($B$5&\"_key\"),MATCH(V$13,INDIRECT($B$5&\"_key[RAMM field name]\"),0),1),INDIRECT($B$5&\"_\"&$C$5&\"[#Headers]\"),0))))","v":{"$error":"#N/A"}},{"$f":"IF(ISBLANK(INDEX(INDIRECT($B$5&\"_\"&$C$5),ROW()-13,MATCH(INDEX(INDIRECT($B$5&\"_key\"),MATCH(W$13,INDIRECT($B$5&\"_key[RAMM field name]\"),0),1),INDIRECT($B$5&\"_\"&$C$5&\"[#Headers]\"),0))),\nIF(INDEX(INDIRECT($B$5&\"_key\"),MATCH(W$13,INDIRECT($B$5&\"_key[RAMM field name]\"),0),6)=\"Y\",\"\"&INDEX(INDIRECT($B$5&\"_key\"),MATCH(W$13,INDIRECT($B$5&\"_key[RAMM field name]\"),0),7),\"\"),\nIF(INDEX(INDIRECT($B$5&\"_key\"),MATCH(W$13,INDIRECT($B$5&\"_key[RAMM field name]\"),0),3)=\"lookup\",\nINDEX(INDIRECT(INDEX(INDIRECT($B$5&\"_key\"),MATCH(W$13,INDIRECT($B$5&\"_key[RAMM field name]\"),0),4)),\nMATCH(INDEX(INDIRECT($B$5&\"_\"&$C$5),ROW()-13,MATCH(INDEX(INDIRECT($B$5&\"_key\"),MATCH(W$13,INDIRECT($B$5&\"_key[RAMM field name]\"),0),1),INDIRECT($B$5&\"_\"&$C$5&\"[#Headers]\"),0)),\nINDIRECT(INDEX(INDIRECT($B$5&\"_key\"),MATCH(W$13,INDIRECT($B$5&\"_key[RAMM field name]\"),0),4)&\"[\"&INDEX(INDIRECT($B$5&\"_key\"),MATCH(W$13,INDIRECT($B$5&\"_key[RAMM field name]\"),0),2)&\"]\"),0),1),\nINDEX(INDIRECT($B$5&\"_\"&$C$5),ROW()-13,MATCH(INDEX(INDIRECT($B$5&\"_key\"),MATCH(W$13,INDIRECT($B$5&\"_key[RAMM field name]\"),0),1),INDIRECT($B$5&\"_\"&$C$5&\"[#Headers]\"),0))))","v":{"$error":"#N/A"}},{"$f":"IF(ISBLANK(INDEX(INDIRECT($B$5&\"_\"&$C$5),ROW()-13,MATCH(INDEX(INDIRECT($B$5&\"_key\"),MATCH(X$13,INDIRECT($B$5&\"_key[RAMM field name]\"),0),1),INDIRECT($B$5&\"_\"&$C$5&\"[#Headers]\"),0))),\nIF(INDEX(INDIRECT($B$5&\"_key\"),MATCH(X$13,INDIRECT($B$5&\"_key[RAMM field name]\"),0),6)=\"Y\",\"\"&INDEX(INDIRECT($B$5&\"_key\"),MATCH(X$13,INDIRECT($B$5&\"_key[RAMM field name]\"),0),7),\"\"),\nIF(INDEX(INDIRECT($B$5&\"_key\"),MATCH(X$13,INDIRECT($B$5&\"_key[RAMM field name]\"),0),3)=\"lookup\",\nINDEX(INDIRECT(INDEX(INDIRECT($B$5&\"_key\"),MATCH(X$13,INDIRECT($B$5&\"_key[RAMM field name]\"),0),4)),\nMATCH(INDEX(INDIRECT($B$5&\"_\"&$C$5),ROW()-13,MATCH(INDEX(INDIRECT($B$5&\"_key\"),MATCH(X$13,INDIRECT($B$5&\"_key[RAMM field name]\"),0),1),INDIRECT($B$5&\"_\"&$C$5&\"[#Headers]\"),0)),\nINDIRECT(INDEX(INDIRECT($B$5&\"_key\"),MATCH(X$13,INDIRECT($B$5&\"_key[RAMM field name]\"),0),4)&\"[\"&INDEX(INDIRECT($B$5&\"_key\"),MATCH(X$13,INDIRECT($B$5&\"_key[RAMM field name]\"),0),2)&\"]\"),0),1),\nINDEX(INDIRECT($B$5&\"_\"&$C$5),ROW()-13,MATCH(INDEX(INDIRECT($B$5&\"_key\"),MATCH(X$13,INDIRECT($B$5&\"_key[RAMM field name]\"),0),1),INDIRECT($B$5&\"_\"&$C$5&\"[#Headers]\"),0))))","v":{"$error":"#N/A"}},{"$f":"IF(ISBLANK(INDEX(INDIRECT($B$5&\"_\"&$C$5),ROW()-13,MATCH(INDEX(INDIRECT($B$5&\"_key\"),MATCH(Y$13,INDIRECT($B$5&\"_key[RAMM field name]\"),0),1),INDIRECT($B$5&\"_\"&$C$5&\"[#Headers]\"),0))),\nIF(INDEX(INDIRECT($B$5&\"_key\"),MATCH(Y$13,INDIRECT($B$5&\"_key[RAMM field name]\"),0),6)=\"Y\",\"\"&INDEX(INDIRECT($B$5&\"_key\"),MATCH(Y$13,INDIRECT($B$5&\"_key[RAMM field name]\"),0),7),\"\"),\nIF(INDEX(INDIRECT($B$5&\"_key\"),MATCH(Y$13,INDIRECT($B$5&\"_key[RAMM field name]\"),0),3)=\"lookup\",\nINDEX(INDIRECT(INDEX(INDIRECT($B$5&\"_key\"),MATCH(Y$13,INDIRECT($B$5&\"_key[RAMM field name]\"),0),4)),\nMATCH(INDEX(INDIRECT($B$5&\"_\"&$C$5),ROW()-13,MATCH(INDEX(INDIRECT($B$5&\"_key\"),MATCH(Y$13,INDIRECT($B$5&\"_key[RAMM field name]\"),0),1),INDIRECT($B$5&\"_\"&$C$5&\"[#Headers]\"),0)),\nINDIRECT(INDEX(INDIRECT($B$5&\"_key\"),MATCH(Y$13,INDIRECT($B$5&\"_key[RAMM field name]\"),0),4)&\"[\"&INDEX(INDIRECT($B$5&\"_key\"),MATCH(Y$13,INDIRECT($B$5&\"_key[RAMM field name]\"),0),2)&\"]\"),0),1),\nINDEX(INDIRECT($B$5&\"_\"&$C$5),ROW()-13,MATCH(INDEX(INDIRECT($B$5&\"_key\"),MATCH(Y$13,INDIRECT($B$5&\"_key[RAMM field name]\"),0),1),INDIRECT($B$5&\"_\"&$C$5&\"[#Headers]\"),0))))","v":{"$error":"#N/A"}},{"$f":"IF(ISBLANK(INDEX(INDIRECT($B$5&\"_\"&$C$5),ROW()-13,MATCH(INDEX(INDIRECT($B$5&\"_key\"),MATCH(Z$13,INDIRECT($B$5&\"_key[RAMM field name]\"),0),1),INDIRECT($B$5&\"_\"&$C$5&\"[#Headers]\"),0))),\nIF(INDEX(INDIRECT($B$5&\"_key\"),MATCH(Z$13,INDIRECT($B$5&\"_key[RAMM field name]\"),0),6)=\"Y\",\"\"&INDEX(INDIRECT($B$5&\"_key\"),MATCH(Z$13,INDIRECT($B$5&\"_key[RAMM field name]\"),0),7),\"\"),\nIF(INDEX(INDIRECT($B$5&\"_key\"),MATCH(Z$13,INDIRECT($B$5&\"_key[RAMM field name]\"),0),3)=\"lookup\",\nINDEX(INDIRECT(INDEX(INDIRECT($B$5&\"_key\"),MATCH(Z$13,INDIRECT($B$5&\"_key[RAMM field name]\"),0),4)),\nMATCH(INDEX(INDIRECT($B$5&\"_\"&$C$5),ROW()-13,MATCH(INDEX(INDIRECT($B$5&\"_key\"),MATCH(Z$13,INDIRECT($B$5&\"_key[RAMM field name]\"),0),1),INDIRECT($B$5&\"_\"&$C$5&\"[#Headers]\"),0)),\nINDIRECT(INDEX(INDIRECT($B$5&\"_key\"),MATCH(Z$13,INDIRECT($B$5&\"_key[RAMM field name]\"),0),4)&\"[\"&INDEX(INDIRECT($B$5&\"_key\"),MATCH(Z$13,INDIRECT($B$5&\"_key[RAMM field name]\"),0),2)&\"]\"),0),1),\nINDEX(INDIRECT($B$5&\"_\"&$C$5),ROW()-13,MATCH(INDEX(INDIRECT($B$5&\"_key\"),MATCH(Z$13,INDIRECT($B$5&\"_key[RAMM field name]\"),0),1),INDIRECT($B$5&\"_\"&$C$5&\"[#Headers]\"),0))))","v":{"$error":"#N/A"}},{"$f":"IF(ISBLANK(INDEX(INDIRECT($B$5&\"_\"&$C$5),ROW()-13,MATCH(INDEX(INDIRECT($B$5&\"_key\"),MATCH(AA$13,INDIRECT($B$5&\"_key[RAMM field name]\"),0),1),INDIRECT($B$5&\"_\"&$C$5&\"[#Headers]\"),0))),\nIF(INDEX(INDIRECT($B$5&\"_key\"),MATCH(AA$13,INDIRECT($B$5&\"_key[RAMM field name]\"),0),6)=\"Y\",\"\"&INDEX(INDIRECT($B$5&\"_key\"),MATCH(AA$13,INDIRECT($B$5&\"_key[RAMM field name]\"),0),7),\"\"),\nIF(INDEX(INDIRECT($B$5&\"_key\"),MATCH(AA$13,INDIRECT($B$5&\"_key[RAMM field name]\"),0),3)=\"lookup\",\nINDEX(INDIRECT(INDEX(INDIRECT($B$5&\"_key\"),MATCH(AA$13,INDIRECT($B$5&\"_key[RAMM field name]\"),0),4)),\nMATCH(INDEX(INDIRECT($B$5&\"_\"&$C$5),ROW()-13,MATCH(INDEX(INDIRECT($B$5&\"_key\"),MATCH(AA$13,INDIRECT($B$5&\"_key[RAMM field name]\"),0),1),INDIRECT($B$5&\"_\"&$C$5&\"[#Headers]\"),0)),\nINDIRECT(INDEX(INDIRECT($B$5&\"_key\"),MATCH(AA$13,INDIRECT($B$5&\"_key[RAMM field name]\"),0),4)&\"[\"&INDEX(INDIRECT($B$5&\"_key\"),MATCH(AA$13,INDIRECT($B$5&\"_key[RAMM field name]\"),0),2)&\"]\"),0),1),\nINDEX(INDIRECT($B$5&\"_\"&$C$5),ROW()-13,MATCH(INDEX(INDIRECT($B$5&\"_key\"),MATCH(AA$13,INDIRECT($B$5&\"_key[RAMM field name]\"),0),1),INDIRECT($B$5&\"_\"&$C$5&\"[#Headers]\"),0))))","v":{"$error":"#N/A"}},{"$f":"IF(ISBLANK(INDEX(INDIRECT($B$5&\"_\"&$C$5),ROW()-13,MATCH(INDEX(INDIRECT($B$5&\"_key\"),MATCH(AB$13,INDIRECT($B$5&\"_key[RAMM field name]\"),0),1),INDIRECT($B$5&\"_\"&$C$5&\"[#Headers]\"),0))),\nIF(INDEX(INDIRECT($B$5&\"_key\"),MATCH(AB$13,INDIRECT($B$5&\"_key[RAMM field name]\"),0),6)=\"Y\",\"\"&INDEX(INDIRECT($B$5&\"_key\"),MATCH(AB$13,INDIRECT($B$5&\"_key[RAMM field name]\"),0),7),\"\"),\nIF(INDEX(INDIRECT($B$5&\"_key\"),MATCH(AB$13,INDIRECT($B$5&\"_key[RAMM field name]\"),0),3)=\"lookup\",\nINDEX(INDIRECT(INDEX(INDIRECT($B$5&\"_key\"),MATCH(AB$13,INDIRECT($B$5&\"_key[RAMM field name]\"),0),4)),\nMATCH(INDEX(INDIRECT($B$5&\"_\"&$C$5),ROW()-13,MATCH(INDEX(INDIRECT($B$5&\"_key\"),MATCH(AB$13,INDIRECT($B$5&\"_key[RAMM field name]\"),0),1),INDIRECT($B$5&\"_\"&$C$5&\"[#Headers]\"),0)),\nINDIRECT(INDEX(INDIRECT($B$5&\"_key\"),MATCH(AB$13,INDIRECT($B$5&\"_key[RAMM field name]\"),0),4)&\"[\"&INDEX(INDIRECT($B$5&\"_key\"),MATCH(AB$13,INDIRECT($B$5&\"_key[RAMM field name]\"),0),2)&\"]\"),0),1),\nINDEX(INDIRECT($B$5&\"_\"&$C$5),ROW()-13,MATCH(INDEX(INDIRECT($B$5&\"_key\"),MATCH(AB$13,INDIRECT($B$5&\"_key[RAMM field name]\"),0),1),INDIRECT($B$5&\"_\"&$C$5&\"[#Headers]\"),0))))","v":{"$error":"#N/A"}},{"$f":"IF(ISBLANK(INDEX(INDIRECT($B$5&\"_\"&$C$5),ROW()-13,MATCH(INDEX(INDIRECT($B$5&\"_key\"),MATCH(AC$13,INDIRECT($B$5&\"_key[RAMM field name]\"),0),1),INDIRECT($B$5&\"_\"&$C$5&\"[#Headers]\"),0))),\nIF(INDEX(INDIRECT($B$5&\"_key\"),MATCH(AC$13,INDIRECT($B$5&\"_key[RAMM field name]\"),0),6)=\"Y\",\"\"&INDEX(INDIRECT($B$5&\"_key\"),MATCH(AC$13,INDIRECT($B$5&\"_key[RAMM field name]\"),0),7),\"\"),\nIF(INDEX(INDIRECT($B$5&\"_key\"),MATCH(AC$13,INDIRECT($B$5&\"_key[RAMM field name]\"),0),3)=\"lookup\",\nINDEX(INDIRECT(INDEX(INDIRECT($B$5&\"_key\"),MATCH(AC$13,INDIRECT($B$5&\"_key[RAMM field name]\"),0),4)),\nMATCH(INDEX(INDIRECT($B$5&\"_\"&$C$5),ROW()-13,MATCH(INDEX(INDIRECT($B$5&\"_key\"),MATCH(AC$13,INDIRECT($B$5&\"_key[RAMM field name]\"),0),1),INDIRECT($B$5&\"_\"&$C$5&\"[#Headers]\"),0)),\nINDIRECT(INDEX(INDIRECT($B$5&\"_key\"),MATCH(AC$13,INDIRECT($B$5&\"_key[RAMM field name]\"),0),4)&\"[\"&INDEX(INDIRECT($B$5&\"_key\"),MATCH(AC$13,INDIRECT($B$5&\"_key[RAMM field name]\"),0),2)&\"]\"),0),1),\nINDEX(INDIRECT($B$5&\"_\"&$C$5),ROW()-13,MATCH(INDEX(INDIRECT($B$5&\"_key\"),MATCH(AC$13,INDIRECT($B$5&\"_key[RAMM field name]\"),0),1),INDIRECT($B$5&\"_\"&$C$5&\"[#Headers]\"),0))))","v":{"$error":"#N/A"}},{"$f":"IF(ISBLANK(INDEX(INDIRECT($B$5&\"_\"&$C$5),ROW()-13,MATCH(INDEX(INDIRECT($B$5&\"_key\"),MATCH(AD$13,INDIRECT($B$5&\"_key[RAMM field name]\"),0),1),INDIRECT($B$5&\"_\"&$C$5&\"[#Headers]\"),0))),\nIF(INDEX(INDIRECT($B$5&\"_key\"),MATCH(AD$13,INDIRECT($B$5&\"_key[RAMM field name]\"),0),6)=\"Y\",\"\"&INDEX(INDIRECT($B$5&\"_key\"),MATCH(AD$13,INDIRECT($B$5&\"_key[RAMM field name]\"),0),7),\"\"),\nIF(INDEX(INDIRECT($B$5&\"_key\"),MATCH(AD$13,INDIRECT($B$5&\"_key[RAMM field name]\"),0),3)=\"lookup\",\nINDEX(INDIRECT(INDEX(INDIRECT($B$5&\"_key\"),MATCH(AD$13,INDIRECT($B$5&\"_key[RAMM field name]\"),0),4)),\nMATCH(INDEX(INDIRECT($B$5&\"_\"&$C$5),ROW()-13,MATCH(INDEX(INDIRECT($B$5&\"_key\"),MATCH(AD$13,INDIRECT($B$5&\"_key[RAMM field name]\"),0),1),INDIRECT($B$5&\"_\"&$C$5&\"[#Headers]\"),0)),\nINDIRECT(INDEX(INDIRECT($B$5&\"_key\"),MATCH(AD$13,INDIRECT($B$5&\"_key[RAMM field name]\"),0),4)&\"[\"&INDEX(INDIRECT($B$5&\"_key\"),MATCH(AD$13,INDIRECT($B$5&\"_key[RAMM field name]\"),0),2)&\"]\"),0),1),\nINDEX(INDIRECT($B$5&\"_\"&$C$5),ROW()-13,MATCH(INDEX(INDIRECT($B$5&\"_key\"),MATCH(AD$13,INDIRECT($B$5&\"_key[RAMM field name]\"),0),1),INDIRECT($B$5&\"_\"&$C$5&\"[#Headers]\"),0))))","v":{"$error":"#N/A"}},{"$f":"IF(ISBLANK(INDEX(INDIRECT($B$5&\"_\"&$C$5),ROW()-13,MATCH(INDEX(INDIRECT($B$5&\"_key\"),MATCH(AE$13,INDIRECT($B$5&\"_key[RAMM field name]\"),0),1),INDIRECT($B$5&\"_\"&$C$5&\"[#Headers]\"),0))),\nIF(INDEX(INDIRECT($B$5&\"_key\"),MATCH(AE$13,INDIRECT($B$5&\"_key[RAMM field name]\"),0),6)=\"Y\",\"\"&INDEX(INDIRECT($B$5&\"_key\"),MATCH(AE$13,INDIRECT($B$5&\"_key[RAMM field name]\"),0),7),\"\"),\nIF(INDEX(INDIRECT($B$5&\"_key\"),MATCH(AE$13,INDIRECT($B$5&\"_key[RAMM field name]\"),0),3)=\"lookup\",\nINDEX(INDIRECT(INDEX(INDIRECT($B$5&\"_key\"),MATCH(AE$13,INDIRECT($B$5&\"_key[RAMM field name]\"),0),4)),\nMATCH(INDEX(INDIRECT($B$5&\"_\"&$C$5),ROW()-13,MATCH(INDEX(INDIRECT($B$5&\"_key\"),MATCH(AE$13,INDIRECT($B$5&\"_key[RAMM field name]\"),0),1),INDIRECT($B$5&\"_\"&$C$5&\"[#Headers]\"),0)),\nINDIRECT(INDEX(INDIRECT($B$5&\"_key\"),MATCH(AE$13,INDIRECT($B$5&\"_key[RAMM field name]\"),0),4)&\"[\"&INDEX(INDIRECT($B$5&\"_key\"),MATCH(AE$13,INDIRECT($B$5&\"_key[RAMM field name]\"),0),2)&\"]\"),0),1),\nINDEX(INDIRECT($B$5&\"_\"&$C$5),ROW()-13,MATCH(INDEX(INDIRECT($B$5&\"_key\"),MATCH(AE$13,INDIRECT($B$5&\"_key[RAMM field name]\"),0),1),INDIRECT($B$5&\"_\"&$C$5&\"[#Headers]\"),0))))","v":{"$error":"#N/A"}},{"$f":"IF(ISBLANK(INDEX(INDIRECT($B$5&\"_\"&$C$5),ROW()-13,MATCH(INDEX(INDIRECT($B$5&\"_key\"),MATCH(AF$13,INDIRECT($B$5&\"_key[RAMM field name]\"),0),1),INDIRECT($B$5&\"_\"&$C$5&\"[#Headers]\"),0))),\nIF(INDEX(INDIRECT($B$5&\"_key\"),MATCH(AF$13,INDIRECT($B$5&\"_key[RAMM field name]\"),0),6)=\"Y\",\"\"&INDEX(INDIRECT($B$5&\"_key\"),MATCH(AF$13,INDIRECT($B$5&\"_key[RAMM field name]\"),0),7),\"\"),\nIF(INDEX(INDIRECT($B$5&\"_key\"),MATCH(AF$13,INDIRECT($B$5&\"_key[RAMM field name]\"),0),3)=\"lookup\",\nINDEX(INDIRECT(INDEX(INDIRECT($B$5&\"_key\"),MATCH(AF$13,INDIRECT($B$5&\"_key[RAMM field name]\"),0),4)),\nMATCH(INDEX(INDIRECT($B$5&\"_\"&$C$5),ROW()-13,MATCH(INDEX(INDIRECT($B$5&\"_key\"),MATCH(AF$13,INDIRECT($B$5&\"_key[RAMM field name]\"),0),1),INDIRECT($B$5&\"_\"&$C$5&\"[#Headers]\"),0)),\nINDIRECT(INDEX(INDIRECT($B$5&\"_key\"),MATCH(AF$13,INDIRECT($B$5&\"_key[RAMM field name]\"),0),4)&\"[\"&INDEX(INDIRECT($B$5&\"_key\"),MATCH(AF$13,INDIRECT($B$5&\"_key[RAMM field name]\"),0),2)&\"]\"),0),1),\nINDEX(INDIRECT($B$5&\"_\"&$C$5),ROW()-13,MATCH(INDEX(INDIRECT($B$5&\"_key\"),MATCH(AF$13,INDIRECT($B$5&\"_key[RAMM field name]\"),0),1),INDIRECT($B$5&\"_\"&$C$5&\"[#Headers]\"),0))))","v":{"$error":"#N/A"}},{"$f":"IF(ISBLANK(INDEX(INDIRECT($B$5&\"_\"&$C$5),ROW()-13,MATCH(INDEX(INDIRECT($B$5&\"_key\"),MATCH(AG$13,INDIRECT($B$5&\"_key[RAMM field name]\"),0),1),INDIRECT($B$5&\"_\"&$C$5&\"[#Headers]\"),0))),\nIF(INDEX(INDIRECT($B$5&\"_key\"),MATCH(AG$13,INDIRECT($B$5&\"_key[RAMM field name]\"),0),6)=\"Y\",\"\"&INDEX(INDIRECT($B$5&\"_key\"),MATCH(AG$13,INDIRECT($B$5&\"_key[RAMM field name]\"),0),7),\"\"),\nIF(INDEX(INDIRECT($B$5&\"_key\"),MATCH(AG$13,INDIRECT($B$5&\"_key[RAMM field name]\"),0),3)=\"lookup\",\nINDEX(INDIRECT(INDEX(INDIRECT($B$5&\"_key\"),MATCH(AG$13,INDIRECT($B$5&\"_key[RAMM field name]\"),0),4)),\nMATCH(INDEX(INDIRECT($B$5&\"_\"&$C$5),ROW()-13,MATCH(INDEX(INDIRECT($B$5&\"_key\"),MATCH(AG$13,INDIRECT($B$5&\"_key[RAMM field name]\"),0),1),INDIRECT($B$5&\"_\"&$C$5&\"[#Headers]\"),0)),\nINDIRECT(INDEX(INDIRECT($B$5&\"_key\"),MATCH(AG$13,INDIRECT($B$5&\"_key[RAMM field name]\"),0),4)&\"[\"&INDEX(INDIRECT($B$5&\"_key\"),MATCH(AG$13,INDIRECT($B$5&\"_key[RAMM field name]\"),0),2)&\"]\"),0),1),\nINDEX(INDIRECT($B$5&\"_\"&$C$5),ROW()-13,MATCH(INDEX(INDIRECT($B$5&\"_key\"),MATCH(AG$13,INDIRECT($B$5&\"_key[RAMM field name]\"),0),1),INDIRECT($B$5&\"_\"&$C$5&\"[#Headers]\"),0))))","v":{"$error":"#N/A"}},{"$f":"IF(ISBLANK(INDEX(INDIRECT($B$5&\"_\"&$C$5),ROW()-13,MATCH(INDEX(INDIRECT($B$5&\"_key\"),MATCH(AH$13,INDIRECT($B$5&\"_key[RAMM field name]\"),0),1),INDIRECT($B$5&\"_\"&$C$5&\"[#Headers]\"),0))),\nIF(INDEX(INDIRECT($B$5&\"_key\"),MATCH(AH$13,INDIRECT($B$5&\"_key[RAMM field name]\"),0),6)=\"Y\",\"\"&INDEX(INDIRECT($B$5&\"_key\"),MATCH(AH$13,INDIRECT($B$5&\"_key[RAMM field name]\"),0),7),\"\"),\nIF(INDEX(INDIRECT($B$5&\"_key\"),MATCH(AH$13,INDIRECT($B$5&\"_key[RAMM field name]\"),0),3)=\"lookup\",\nINDEX(INDIRECT(INDEX(INDIRECT($B$5&\"_key\"),MATCH(AH$13,INDIRECT($B$5&\"_key[RAMM field name]\"),0),4)),\nMATCH(INDEX(INDIRECT($B$5&\"_\"&$C$5),ROW()-13,MATCH(INDEX(INDIRECT($B$5&\"_key\"),MATCH(AH$13,INDIRECT($B$5&\"_key[RAMM field name]\"),0),1),INDIRECT($B$5&\"_\"&$C$5&\"[#Headers]\"),0)),\nINDIRECT(INDEX(INDIRECT($B$5&\"_key\"),MATCH(AH$13,INDIRECT($B$5&\"_key[RAMM field name]\"),0),4)&\"[\"&INDEX(INDIRECT($B$5&\"_key\"),MATCH(AH$13,INDIRECT($B$5&\"_key[RAMM field name]\"),0),2)&\"]\"),0),1),\nINDEX(INDIRECT($B$5&\"_\"&$C$5),ROW()-13,MATCH(INDEX(INDIRECT($B$5&\"_key\"),MATCH(AH$13,INDIRECT($B$5&\"_key[RAMM field name]\"),0),1),INDIRECT($B$5&\"_\"&$C$5&\"[#Headers]\"),0))))","v":{"$error":"#N/A"}},{"$f":"IF(ISBLANK(INDEX(INDIRECT($B$5&\"_\"&$C$5),ROW()-13,MATCH(INDEX(INDIRECT($B$5&\"_key\"),MATCH(AI$13,INDIRECT($B$5&\"_key[RAMM field name]\"),0),1),INDIRECT($B$5&\"_\"&$C$5&\"[#Headers]\"),0))),\nIF(INDEX(INDIRECT($B$5&\"_key\"),MATCH(AI$13,INDIRECT($B$5&\"_key[RAMM field name]\"),0),6)=\"Y\",\"\"&INDEX(INDIRECT($B$5&\"_key\"),MATCH(AI$13,INDIRECT($B$5&\"_key[RAMM field name]\"),0),7),\"\"),\nIF(INDEX(INDIRECT($B$5&\"_key\"),MATCH(AI$13,INDIRECT($B$5&\"_key[RAMM field name]\"),0),3)=\"lookup\",\nINDEX(INDIRECT(INDEX(INDIRECT($B$5&\"_key\"),MATCH(AI$13,INDIRECT($B$5&\"_key[RAMM field name]\"),0),4)),\nMATCH(INDEX(INDIRECT($B$5&\"_\"&$C$5),ROW()-13,MATCH(INDEX(INDIRECT($B$5&\"_key\"),MATCH(AI$13,INDIRECT($B$5&\"_key[RAMM field name]\"),0),1),INDIRECT($B$5&\"_\"&$C$5&\"[#Headers]\"),0)),\nINDIRECT(INDEX(INDIRECT($B$5&\"_key\"),MATCH(AI$13,INDIRECT($B$5&\"_key[RAMM field name]\"),0),4)&\"[\"&INDEX(INDIRECT($B$5&\"_key\"),MATCH(AI$13,INDIRECT($B$5&\"_key[RAMM field name]\"),0),2)&\"]\"),0),1),\nINDEX(INDIRECT($B$5&\"_\"&$C$5),ROW()-13,MATCH(INDEX(INDIRECT($B$5&\"_key\"),MATCH(AI$13,INDIRECT($B$5&\"_key[RAMM field name]\"),0),1),INDIRECT($B$5&\"_\"&$C$5&\"[#Headers]\"),0))))","v":{"$error":"#N/A"}},{"$f":"IF(ISBLANK(INDEX(INDIRECT($B$5&\"_\"&$C$5),ROW()-13,MATCH(INDEX(INDIRECT($B$5&\"_key\"),MATCH(AJ$13,INDIRECT($B$5&\"_key[RAMM field name]\"),0),1),INDIRECT($B$5&\"_\"&$C$5&\"[#Headers]\"),0))),\nIF(INDEX(INDIRECT($B$5&\"_key\"),MATCH(AJ$13,INDIRECT($B$5&\"_key[RAMM field name]\"),0),6)=\"Y\",\"\"&INDEX(INDIRECT($B$5&\"_key\"),MATCH(AJ$13,INDIRECT($B$5&\"_key[RAMM field name]\"),0),7),\"\"),\nIF(INDEX(INDIRECT($B$5&\"_key\"),MATCH(AJ$13,INDIRECT($B$5&\"_key[RAMM field name]\"),0),3)=\"lookup\",\nINDEX(INDIRECT(INDEX(INDIRECT($B$5&\"_key\"),MATCH(AJ$13,INDIRECT($B$5&\"_key[RAMM field name]\"),0),4)),\nMATCH(INDEX(INDIRECT($B$5&\"_\"&$C$5),ROW()-13,MATCH(INDEX(INDIRECT($B$5&\"_key\"),MATCH(AJ$13,INDIRECT($B$5&\"_key[RAMM field name]\"),0),1),INDIRECT($B$5&\"_\"&$C$5&\"[#Headers]\"),0)),\nINDIRECT(INDEX(INDIRECT($B$5&\"_key\"),MATCH(AJ$13,INDIRECT($B$5&\"_key[RAMM field name]\"),0),4)&\"[\"&INDEX(INDIRECT($B$5&\"_key\"),MATCH(AJ$13,INDIRECT($B$5&\"_key[RAMM field name]\"),0),2)&\"]\"),0),1),\nINDEX(INDIRECT($B$5&\"_\"&$C$5),ROW()-13,MATCH(INDEX(INDIRECT($B$5&\"_key\"),MATCH(AJ$13,INDIRECT($B$5&\"_key[RAMM field name]\"),0),1),INDIRECT($B$5&\"_\"&$C$5&\"[#Headers]\"),0))))","v":{"$error":"#N/A"}},{"$f":"IF(ISBLANK(INDEX(INDIRECT($B$5&\"_\"&$C$5),ROW()-13,MATCH(INDEX(INDIRECT($B$5&\"_key\"),MATCH(AK$13,INDIRECT($B$5&\"_key[RAMM field name]\"),0),1),INDIRECT($B$5&\"_\"&$C$5&\"[#Headers]\"),0))),\nIF(INDEX(INDIRECT($B$5&\"_key\"),MATCH(AK$13,INDIRECT($B$5&\"_key[RAMM field name]\"),0),6)=\"Y\",\"\"&INDEX(INDIRECT($B$5&\"_key\"),MATCH(AK$13,INDIRECT($B$5&\"_key[RAMM field name]\"),0),7),\"\"),\nIF(INDEX(INDIRECT($B$5&\"_key\"),MATCH(AK$13,INDIRECT($B$5&\"_key[RAMM field name]\"),0),3)=\"lookup\",\nINDEX(INDIRECT(INDEX(INDIRECT($B$5&\"_key\"),MATCH(AK$13,INDIRECT($B$5&\"_key[RAMM field name]\"),0),4)),\nMATCH(INDEX(INDIRECT($B$5&\"_\"&$C$5),ROW()-13,MATCH(INDEX(INDIRECT($B$5&\"_key\"),MATCH(AK$13,INDIRECT($B$5&\"_key[RAMM field name]\"),0),1),INDIRECT($B$5&\"_\"&$C$5&\"[#Headers]\"),0)),\nINDIRECT(INDEX(INDIRECT($B$5&\"_key\"),MATCH(AK$13,INDIRECT($B$5&\"_key[RAMM field name]\"),0),4)&\"[\"&INDEX(INDIRECT($B$5&\"_key\"),MATCH(AK$13,INDIRECT($B$5&\"_key[RAMM field name]\"),0),2)&\"]\"),0),1),\nINDEX(INDIRECT($B$5&\"_\"&$C$5),ROW()-13,MATCH(INDEX(INDIRECT($B$5&\"_key\"),MATCH(AK$13,INDIRECT($B$5&\"_key[RAMM field name]\"),0),1),INDIRECT($B$5&\"_\"&$C$5&\"[#Headers]\"),0))))","v":{"$error":"#N/A"}},{"$f":"IF(ISBLANK(INDEX(INDIRECT($B$5&\"_\"&$C$5),ROW()-13,MATCH(INDEX(INDIRECT($B$5&\"_key\"),MATCH(AL$13,INDIRECT($B$5&\"_key[RAMM field name]\"),0),1),INDIRECT($B$5&\"_\"&$C$5&\"[#Headers]\"),0))),\nIF(INDEX(INDIRECT($B$5&\"_key\"),MATCH(AL$13,INDIRECT($B$5&\"_key[RAMM field name]\"),0),6)=\"Y\",\"\"&INDEX(INDIRECT($B$5&\"_key\"),MATCH(AL$13,INDIRECT($B$5&\"_key[RAMM field name]\"),0),7),\"\"),\nIF(INDEX(INDIRECT($B$5&\"_key\"),MATCH(AL$13,INDIRECT($B$5&\"_key[RAMM field name]\"),0),3)=\"lookup\",\nINDEX(INDIRECT(INDEX(INDIRECT($B$5&\"_key\"),MATCH(AL$13,INDIRECT($B$5&\"_key[RAMM field name]\"),0),4)),\nMATCH(INDEX(INDIRECT($B$5&\"_\"&$C$5),ROW()-13,MATCH(INDEX(INDIRECT($B$5&\"_key\"),MATCH(AL$13,INDIRECT($B$5&\"_key[RAMM field name]\"),0),1),INDIRECT($B$5&\"_\"&$C$5&\"[#Headers]\"),0)),\nINDIRECT(INDEX(INDIRECT($B$5&\"_key\"),MATCH(AL$13,INDIRECT($B$5&\"_key[RAMM field name]\"),0),4)&\"[\"&INDEX(INDIRECT($B$5&\"_key\"),MATCH(AL$13,INDIRECT($B$5&\"_key[RAMM field name]\"),0),2)&\"]\"),0),1),\nINDEX(INDIRECT($B$5&\"_\"&$C$5),ROW()-13,MATCH(INDEX(INDIRECT($B$5&\"_key\"),MATCH(AL$13,INDIRECT($B$5&\"_key[RAMM field name]\"),0),1),INDIRECT($B$5&\"_\"&$C$5&\"[#Headers]\"),0))))","v":{"$error":"#N/A"}},{"$f":"IF(ISBLANK(INDEX(INDIRECT($B$5&\"_\"&$C$5),ROW()-13,MATCH(INDEX(INDIRECT($B$5&\"_key\"),MATCH(AM$13,INDIRECT($B$5&\"_key[RAMM field name]\"),0),1),INDIRECT($B$5&\"_\"&$C$5&\"[#Headers]\"),0))),\nIF(INDEX(INDIRECT($B$5&\"_key\"),MATCH(AM$13,INDIRECT($B$5&\"_key[RAMM field name]\"),0),6)=\"Y\",\"\"&INDEX(INDIRECT($B$5&\"_key\"),MATCH(AM$13,INDIRECT($B$5&\"_key[RAMM field name]\"),0),7),\"\"),\nIF(INDEX(INDIRECT($B$5&\"_key\"),MATCH(AM$13,INDIRECT($B$5&\"_key[RAMM field name]\"),0),3)=\"lookup\",\nINDEX(INDIRECT(INDEX(INDIRECT($B$5&\"_key\"),MATCH(AM$13,INDIRECT($B$5&\"_key[RAMM field name]\"),0),4)),\nMATCH(INDEX(INDIRECT($B$5&\"_\"&$C$5),ROW()-13,MATCH(INDEX(INDIRECT($B$5&\"_key\"),MATCH(AM$13,INDIRECT($B$5&\"_key[RAMM field name]\"),0),1),INDIRECT($B$5&\"_\"&$C$5&\"[#Headers]\"),0)),\nINDIRECT(INDEX(INDIRECT($B$5&\"_key\"),MATCH(AM$13,INDIRECT($B$5&\"_key[RAMM field name]\"),0),4)&\"[\"&INDEX(INDIRECT($B$5&\"_key\"),MATCH(AM$13,INDIRECT($B$5&\"_key[RAMM field name]\"),0),2)&\"]\"),0),1),\nINDEX(INDIRECT($B$5&\"_\"&$C$5),ROW()-13,MATCH(INDEX(INDIRECT($B$5&\"_key\"),MATCH(AM$13,INDIRECT($B$5&\"_key[RAMM field name]\"),0),1),INDIRECT($B$5&\"_\"&$C$5&\"[#Headers]\"),0))))","v":{"$error":"#N/A"}},{"$f":"IF(ISBLANK(INDEX(INDIRECT($B$5&\"_\"&$C$5),ROW()-13,MATCH(INDEX(INDIRECT($B$5&\"_key\"),MATCH(AN$13,INDIRECT($B$5&\"_key[RAMM field name]\"),0),1),INDIRECT($B$5&\"_\"&$C$5&\"[#Headers]\"),0))),\nIF(INDEX(INDIRECT($B$5&\"_key\"),MATCH(AN$13,INDIRECT($B$5&\"_key[RAMM field name]\"),0),6)=\"Y\",\"\"&INDEX(INDIRECT($B$5&\"_key\"),MATCH(AN$13,INDIRECT($B$5&\"_key[RAMM field name]\"),0),7),\"\"),\nIF(INDEX(INDIRECT($B$5&\"_key\"),MATCH(AN$13,INDIRECT($B$5&\"_key[RAMM field name]\"),0),3)=\"lookup\",\nINDEX(INDIRECT(INDEX(INDIRECT($B$5&\"_key\"),MATCH(AN$13,INDIRECT($B$5&\"_key[RAMM field name]\"),0),4)),\nMATCH(INDEX(INDIRECT($B$5&\"_\"&$C$5),ROW()-13,MATCH(INDEX(INDIRECT($B$5&\"_key\"),MATCH(AN$13,INDIRECT($B$5&\"_key[RAMM field name]\"),0),1),INDIRECT($B$5&\"_\"&$C$5&\"[#Headers]\"),0)),\nINDIRECT(INDEX(INDIRECT($B$5&\"_key\"),MATCH(AN$13,INDIRECT($B$5&\"_key[RAMM field name]\"),0),4)&\"[\"&INDEX(INDIRECT($B$5&\"_key\"),MATCH(AN$13,INDIRECT($B$5&\"_key[RAMM field name]\"),0),2)&\"]\"),0),1),\nINDEX(INDIRECT($B$5&\"_\"&$C$5),ROW()-13,MATCH(INDEX(INDIRECT($B$5&\"_key\"),MATCH(AN$13,INDIRECT($B$5&\"_key[RAMM field name]\"),0),1),INDIRECT($B$5&\"_\"&$C$5&\"[#Headers]\"),0))))","v":{"$error":"#N/A"}},{"$f":"IF(ISBLANK(INDEX(INDIRECT($B$5&\"_\"&$C$5),ROW()-13,MATCH(INDEX(INDIRECT($B$5&\"_key\"),MATCH(AO$13,INDIRECT($B$5&\"_key[RAMM field name]\"),0),1),INDIRECT($B$5&\"_\"&$C$5&\"[#Headers]\"),0))),\nIF(INDEX(INDIRECT($B$5&\"_key\"),MATCH(AO$13,INDIRECT($B$5&\"_key[RAMM field name]\"),0),6)=\"Y\",\"\"&INDEX(INDIRECT($B$5&\"_key\"),MATCH(AO$13,INDIRECT($B$5&\"_key[RAMM field name]\"),0),7),\"\"),\nIF(INDEX(INDIRECT($B$5&\"_key\"),MATCH(AO$13,INDIRECT($B$5&\"_key[RAMM field name]\"),0),3)=\"lookup\",\nINDEX(INDIRECT(INDEX(INDIRECT($B$5&\"_key\"),MATCH(AO$13,INDIRECT($B$5&\"_key[RAMM field name]\"),0),4)),\nMATCH(INDEX(INDIRECT($B$5&\"_\"&$C$5),ROW()-13,MATCH(INDEX(INDIRECT($B$5&\"_key\"),MATCH(AO$13,INDIRECT($B$5&\"_key[RAMM field name]\"),0),1),INDIRECT($B$5&\"_\"&$C$5&\"[#Headers]\"),0)),\nINDIRECT(INDEX(INDIRECT($B$5&\"_key\"),MATCH(AO$13,INDIRECT($B$5&\"_key[RAMM field name]\"),0),4)&\"[\"&INDEX(INDIRECT($B$5&\"_key\"),MATCH(AO$13,INDIRECT($B$5&\"_key[RAMM field name]\"),0),2)&\"]\"),0),1),\nINDEX(INDIRECT($B$5&\"_\"&$C$5),ROW()-13,MATCH(INDEX(INDIRECT($B$5&\"_key\"),MATCH(AO$13,INDIRECT($B$5&\"_key[RAMM field name]\"),0),1),INDIRECT($B$5&\"_\"&$C$5&\"[#Headers]\"),0))))","v":{"$error":"#N/A"}},{"$f":"IF(ISBLANK(INDEX(INDIRECT($B$5&\"_\"&$C$5),ROW()-13,MATCH(INDEX(INDIRECT($B$5&\"_key\"),MATCH(AP$13,INDIRECT($B$5&\"_key[RAMM field name]\"),0),1),INDIRECT($B$5&\"_\"&$C$5&\"[#Headers]\"),0))),\nIF(INDEX(INDIRECT($B$5&\"_key\"),MATCH(AP$13,INDIRECT($B$5&\"_key[RAMM field name]\"),0),6)=\"Y\",\"\"&INDEX(INDIRECT($B$5&\"_key\"),MATCH(AP$13,INDIRECT($B$5&\"_key[RAMM field name]\"),0),7),\"\"),\nIF(INDEX(INDIRECT($B$5&\"_key\"),MATCH(AP$13,INDIRECT($B$5&\"_key[RAMM field name]\"),0),3)=\"lookup\",\nINDEX(INDIRECT(INDEX(INDIRECT($B$5&\"_key\"),MATCH(AP$13,INDIRECT($B$5&\"_key[RAMM field name]\"),0),4)),\nMATCH(INDEX(INDIRECT($B$5&\"_\"&$C$5),ROW()-13,MATCH(INDEX(INDIRECT($B$5&\"_key\"),MATCH(AP$13,INDIRECT($B$5&\"_key[RAMM field name]\"),0),1),INDIRECT($B$5&\"_\"&$C$5&\"[#Headers]\"),0)),\nINDIRECT(INDEX(INDIRECT($B$5&\"_key\"),MATCH(AP$13,INDIRECT($B$5&\"_key[RAMM field name]\"),0),4)&\"[\"&INDEX(INDIRECT($B$5&\"_key\"),MATCH(AP$13,INDIRECT($B$5&\"_key[RAMM field name]\"),0),2)&\"]\"),0),1),\nINDEX(INDIRECT($B$5&\"_\"&$C$5),ROW()-13,MATCH(INDEX(INDIRECT($B$5&\"_key\"),MATCH(AP$13,INDIRECT($B$5&\"_key[RAMM field name]\"),0),1),INDIRECT($B$5&\"_\"&$C$5&\"[#Headers]\"),0))))","v":{"$error":"#N/A"}},{"$f":"IF(ISBLANK(INDEX(INDIRECT($B$5&\"_\"&$C$5),ROW()-13,MATCH(INDEX(INDIRECT($B$5&\"_key\"),MATCH(AQ$13,INDIRECT($B$5&\"_key[RAMM field name]\"),0),1),INDIRECT($B$5&\"_\"&$C$5&\"[#Headers]\"),0))),\nIF(INDEX(INDIRECT($B$5&\"_key\"),MATCH(AQ$13,INDIRECT($B$5&\"_key[RAMM field name]\"),0),6)=\"Y\",\"\"&INDEX(INDIRECT($B$5&\"_key\"),MATCH(AQ$13,INDIRECT($B$5&\"_key[RAMM field name]\"),0),7),\"\"),\nIF(INDEX(INDIRECT($B$5&\"_key\"),MATCH(AQ$13,INDIRECT($B$5&\"_key[RAMM field name]\"),0),3)=\"lookup\",\nINDEX(INDIRECT(INDEX(INDIRECT($B$5&\"_key\"),MATCH(AQ$13,INDIRECT($B$5&\"_key[RAMM field name]\"),0),4)),\nMATCH(INDEX(INDIRECT($B$5&\"_\"&$C$5),ROW()-13,MATCH(INDEX(INDIRECT($B$5&\"_key\"),MATCH(AQ$13,INDIRECT($B$5&\"_key[RAMM field name]\"),0),1),INDIRECT($B$5&\"_\"&$C$5&\"[#Headers]\"),0)),\nINDIRECT(INDEX(INDIRECT($B$5&\"_key\"),MATCH(AQ$13,INDIRECT($B$5&\"_key[RAMM field name]\"),0),4)&\"[\"&INDEX(INDIRECT($B$5&\"_key\"),MATCH(AQ$13,INDIRECT($B$5&\"_key[RAMM field name]\"),0),2)&\"]\"),0),1),\nINDEX(INDIRECT($B$5&\"_\"&$C$5),ROW()-13,MATCH(INDEX(INDIRECT($B$5&\"_key\"),MATCH(AQ$13,INDIRECT($B$5&\"_key[RAMM field name]\"),0),1),INDIRECT($B$5&\"_\"&$C$5&\"[#Headers]\"),0))))","v":{"$error":"#N/A"}},{"$f":"IF(ISBLANK(INDEX(INDIRECT($B$5&\"_\"&$C$5),ROW()-13,MATCH(INDEX(INDIRECT($B$5&\"_key\"),MATCH(AR$13,INDIRECT($B$5&\"_key[RAMM field name]\"),0),1),INDIRECT($B$5&\"_\"&$C$5&\"[#Headers]\"),0))),\nIF(INDEX(INDIRECT($B$5&\"_key\"),MATCH(AR$13,INDIRECT($B$5&\"_key[RAMM field name]\"),0),6)=\"Y\",\"\"&INDEX(INDIRECT($B$5&\"_key\"),MATCH(AR$13,INDIRECT($B$5&\"_key[RAMM field name]\"),0),7),\"\"),\nIF(INDEX(INDIRECT($B$5&\"_key\"),MATCH(AR$13,INDIRECT($B$5&\"_key[RAMM field name]\"),0),3)=\"lookup\",\nINDEX(INDIRECT(INDEX(INDIRECT($B$5&\"_key\"),MATCH(AR$13,INDIRECT($B$5&\"_key[RAMM field name]\"),0),4)),\nMATCH(INDEX(INDIRECT($B$5&\"_\"&$C$5),ROW()-13,MATCH(INDEX(INDIRECT($B$5&\"_key\"),MATCH(AR$13,INDIRECT($B$5&\"_key[RAMM field name]\"),0),1),INDIRECT($B$5&\"_\"&$C$5&\"[#Headers]\"),0)),\nINDIRECT(INDEX(INDIRECT($B$5&\"_key\"),MATCH(AR$13,INDIRECT($B$5&\"_key[RAMM field name]\"),0),4)&\"[\"&INDEX(INDIRECT($B$5&\"_key\"),MATCH(AR$13,INDIRECT($B$5&\"_key[RAMM field name]\"),0),2)&\"]\"),0),1),\nINDEX(INDIRECT($B$5&\"_\"&$C$5),ROW()-13,MATCH(INDEX(INDIRECT($B$5&\"_key\"),MATCH(AR$13,INDIRECT($B$5&\"_key[RAMM field name]\"),0),1),INDIRECT($B$5&\"_\"&$C$5&\"[#Headers]\"),0))))","v":{"$error":"#N/A"}},{"$f":"IF(ISBLANK(INDEX(INDIRECT($B$5&\"_\"&$C$5),ROW()-13,MATCH(INDEX(INDIRECT($B$5&\"_key\"),MATCH(AS$13,INDIRECT($B$5&\"_key[RAMM field name]\"),0),1),INDIRECT($B$5&\"_\"&$C$5&\"[#Headers]\"),0))),\nIF(INDEX(INDIRECT($B$5&\"_key\"),MATCH(AS$13,INDIRECT($B$5&\"_key[RAMM field name]\"),0),6)=\"Y\",\"\"&INDEX(INDIRECT($B$5&\"_key\"),MATCH(AS$13,INDIRECT($B$5&\"_key[RAMM field name]\"),0),7),\"\"),\nIF(INDEX(INDIRECT($B$5&\"_key\"),MATCH(AS$13,INDIRECT($B$5&\"_key[RAMM field name]\"),0),3)=\"lookup\",\nINDEX(INDIRECT(INDEX(INDIRECT($B$5&\"_key\"),MATCH(AS$13,INDIRECT($B$5&\"_key[RAMM field name]\"),0),4)),\nMATCH(INDEX(INDIRECT($B$5&\"_\"&$C$5),ROW()-13,MATCH(INDEX(INDIRECT($B$5&\"_key\"),MATCH(AS$13,INDIRECT($B$5&\"_key[RAMM field name]\"),0),1),INDIRECT($B$5&\"_\"&$C$5&\"[#Headers]\"),0)),\nINDIRECT(INDEX(INDIRECT($B$5&\"_key\"),MATCH(AS$13,INDIRECT($B$5&\"_key[RAMM field name]\"),0),4)&\"[\"&INDEX(INDIRECT($B$5&\"_key\"),MATCH(AS$13,INDIRECT($B$5&\"_key[RAMM field name]\"),0),2)&\"]\"),0),1),\nINDEX(INDIRECT($B$5&\"_\"&$C$5),ROW()-13,MATCH(INDEX(INDIRECT($B$5&\"_key\"),MATCH(AS$13,INDIRECT($B$5&\"_key[RAMM field name]\"),0),1),INDIRECT($B$5&\"_\"&$C$5&\"[#Headers]\"),0))))","v":{"$error":"#N/A"}},{"$f":"IF(ISBLANK(INDEX(INDIRECT($B$5&\"_\"&$C$5),ROW()-13,MATCH(INDEX(INDIRECT($B$5&\"_key\"),MATCH(AT$13,INDIRECT($B$5&\"_key[RAMM field name]\"),0),1),INDIRECT($B$5&\"_\"&$C$5&\"[#Headers]\"),0))),\nIF(INDEX(INDIRECT($B$5&\"_key\"),MATCH(AT$13,INDIRECT($B$5&\"_key[RAMM field name]\"),0),6)=\"Y\",\"\"&INDEX(INDIRECT($B$5&\"_key\"),MATCH(AT$13,INDIRECT($B$5&\"_key[RAMM field name]\"),0),7),\"\"),\nIF(INDEX(INDIRECT($B$5&\"_key\"),MATCH(AT$13,INDIRECT($B$5&\"_key[RAMM field name]\"),0),3)=\"lookup\",\nINDEX(INDIRECT(INDEX(INDIRECT($B$5&\"_key\"),MATCH(AT$13,INDIRECT($B$5&\"_key[RAMM field name]\"),0),4)),\nMATCH(INDEX(INDIRECT($B$5&\"_\"&$C$5),ROW()-13,MATCH(INDEX(INDIRECT($B$5&\"_key\"),MATCH(AT$13,INDIRECT($B$5&\"_key[RAMM field name]\"),0),1),INDIRECT($B$5&\"_\"&$C$5&\"[#Headers]\"),0)),\nINDIRECT(INDEX(INDIRECT($B$5&\"_key\"),MATCH(AT$13,INDIRECT($B$5&\"_key[RAMM field name]\"),0),4)&\"[\"&INDEX(INDIRECT($B$5&\"_key\"),MATCH(AT$13,INDIRECT($B$5&\"_key[RAMM field name]\"),0),2)&\"]\"),0),1),\nINDEX(INDIRECT($B$5&\"_\"&$C$5),ROW()-13,MATCH(INDEX(INDIRECT($B$5&\"_key\"),MATCH(AT$13,INDIRECT($B$5&\"_key[RAMM field name]\"),0),1),INDIRECT($B$5&\"_\"&$C$5&\"[#Headers]\"),0))))","v":{"$error":"#N/A"}},{"$f":"IF(ISBLANK(INDEX(INDIRECT($B$5&\"_\"&$C$5),ROW()-13,MATCH(INDEX(INDIRECT($B$5&\"_key\"),MATCH(AU$13,INDIRECT($B$5&\"_key[RAMM field name]\"),0),1),INDIRECT($B$5&\"_\"&$C$5&\"[#Headers]\"),0))),\nIF(INDEX(INDIRECT($B$5&\"_key\"),MATCH(AU$13,INDIRECT($B$5&\"_key[RAMM field name]\"),0),6)=\"Y\",\"\"&INDEX(INDIRECT($B$5&\"_key\"),MATCH(AU$13,INDIRECT($B$5&\"_key[RAMM field name]\"),0),7),\"\"),\nIF(INDEX(INDIRECT($B$5&\"_key\"),MATCH(AU$13,INDIRECT($B$5&\"_key[RAMM field name]\"),0),3)=\"lookup\",\nINDEX(INDIRECT(INDEX(INDIRECT($B$5&\"_key\"),MATCH(AU$13,INDIRECT($B$5&\"_key[RAMM field name]\"),0),4)),\nMATCH(INDEX(INDIRECT($B$5&\"_\"&$C$5),ROW()-13,MATCH(INDEX(INDIRECT($B$5&\"_key\"),MATCH(AU$13,INDIRECT($B$5&\"_key[RAMM field name]\"),0),1),INDIRECT($B$5&\"_\"&$C$5&\"[#Headers]\"),0)),\nINDIRECT(INDEX(INDIRECT($B$5&\"_key\"),MATCH(AU$13,INDIRECT($B$5&\"_key[RAMM field name]\"),0),4)&\"[\"&INDEX(INDIRECT($B$5&\"_key\"),MATCH(AU$13,INDIRECT($B$5&\"_key[RAMM field name]\"),0),2)&\"]\"),0),1),\nINDEX(INDIRECT($B$5&\"_\"&$C$5),ROW()-13,MATCH(INDEX(INDIRECT($B$5&\"_key\"),MATCH(AU$13,INDIRECT($B$5&\"_key[RAMM field name]\"),0),1),INDIRECT($B$5&\"_\"&$C$5&\"[#Headers]\"),0))))","v":{"$error":"#REF!"}},{"$f":"IF(ISBLANK(INDEX(INDIRECT($B$5&\"_\"&$C$5),ROW()-13,MATCH(INDEX(INDIRECT($B$5&\"_key\"),MATCH(AV$13,INDIRECT($B$5&\"_key[RAMM field name]\"),0),1),INDIRECT($B$5&\"_\"&$C$5&\"[#Headers]\"),0))),\nIF(INDEX(INDIRECT($B$5&\"_key\"),MATCH(AV$13,INDIRECT($B$5&\"_key[RAMM field name]\"),0),6)=\"Y\",\"\"&INDEX(INDIRECT($B$5&\"_key\"),MATCH(AV$13,INDIRECT($B$5&\"_key[RAMM field name]\"),0),7),\"\"),\nIF(INDEX(INDIRECT($B$5&\"_key\"),MATCH(AV$13,INDIRECT($B$5&\"_key[RAMM field name]\"),0),3)=\"lookup\",\nINDEX(INDIRECT(INDEX(INDIRECT($B$5&\"_key\"),MATCH(AV$13,INDIRECT($B$5&\"_key[RAMM field name]\"),0),4)),\nMATCH(INDEX(INDIRECT($B$5&\"_\"&$C$5),ROW()-13,MATCH(INDEX(INDIRECT($B$5&\"_key\"),MATCH(AV$13,INDIRECT($B$5&\"_key[RAMM field name]\"),0),1),INDIRECT($B$5&\"_\"&$C$5&\"[#Headers]\"),0)),\nINDIRECT(INDEX(INDIRECT($B$5&\"_key\"),MATCH(AV$13,INDIRECT($B$5&\"_key[RAMM field name]\"),0),4)&\"[\"&INDEX(INDIRECT($B$5&\"_key\"),MATCH(AV$13,INDIRECT($B$5&\"_key[RAMM field name]\"),0),2)&\"]\"),0),1),\nINDEX(INDIRECT($B$5&\"_\"&$C$5),ROW()-13,MATCH(INDEX(INDIRECT($B$5&\"_key\"),MATCH(AV$13,INDIRECT($B$5&\"_key[RAMM field name]\"),0),1),INDIRECT($B$5&\"_\"&$C$5&\"[#Headers]\"),0))))","v":{"$error":"#REF!"}},{"$f":"IF(ISBLANK(INDEX(INDIRECT($B$5&\"_\"&$C$5),ROW()-13,MATCH(INDEX(INDIRECT($B$5&\"_key\"),MATCH(AW$13,INDIRECT($B$5&\"_key[RAMM field name]\"),0),1),INDIRECT($B$5&\"_\"&$C$5&\"[#Headers]\"),0))),\nIF(INDEX(INDIRECT($B$5&\"_key\"),MATCH(AW$13,INDIRECT($B$5&\"_key[RAMM field name]\"),0),6)=\"Y\",\"\"&INDEX(INDIRECT($B$5&\"_key\"),MATCH(AW$13,INDIRECT($B$5&\"_key[RAMM field name]\"),0),7),\"\"),\nIF(INDEX(INDIRECT($B$5&\"_key\"),MATCH(AW$13,INDIRECT($B$5&\"_key[RAMM field name]\"),0),3)=\"lookup\",\nINDEX(INDIRECT(INDEX(INDIRECT($B$5&\"_key\"),MATCH(AW$13,INDIRECT($B$5&\"_key[RAMM field name]\"),0),4)),\nMATCH(INDEX(INDIRECT($B$5&\"_\"&$C$5),ROW()-13,MATCH(INDEX(INDIRECT($B$5&\"_key\"),MATCH(AW$13,INDIRECT($B$5&\"_key[RAMM field name]\"),0),1),INDIRECT($B$5&\"_\"&$C$5&\"[#Headers]\"),0)),\nINDIRECT(INDEX(INDIRECT($B$5&\"_key\"),MATCH(AW$13,INDIRECT($B$5&\"_key[RAMM field name]\"),0),4)&\"[\"&INDEX(INDIRECT($B$5&\"_key\"),MATCH(AW$13,INDIRECT($B$5&\"_key[RAMM field name]\"),0),2)&\"]\"),0),1),\nINDEX(INDIRECT($B$5&\"_\"&$C$5),ROW()-13,MATCH(INDEX(INDIRECT($B$5&\"_key\"),MATCH(AW$13,INDIRECT($B$5&\"_key[RAMM field name]\"),0),1),INDIRECT($B$5&\"_\"&$C$5&\"[#Headers]\"),0))))","v":{"$error":"#REF!"}},{"$f":"IF(ISBLANK(INDEX(INDIRECT($B$5&\"_\"&$C$5),ROW()-13,MATCH(INDEX(INDIRECT($B$5&\"_key\"),MATCH(AX$13,INDIRECT($B$5&\"_key[RAMM field name]\"),0),1),INDIRECT($B$5&\"_\"&$C$5&\"[#Headers]\"),0))),\nIF(INDEX(INDIRECT($B$5&\"_key\"),MATCH(AX$13,INDIRECT($B$5&\"_key[RAMM field name]\"),0),6)=\"Y\",\"\"&INDEX(INDIRECT($B$5&\"_key\"),MATCH(AX$13,INDIRECT($B$5&\"_key[RAMM field name]\"),0),7),\"\"),\nIF(INDEX(INDIRECT($B$5&\"_key\"),MATCH(AX$13,INDIRECT($B$5&\"_key[RAMM field name]\"),0),3)=\"lookup\",\nINDEX(INDIRECT(INDEX(INDIRECT($B$5&\"_key\"),MATCH(AX$13,INDIRECT($B$5&\"_key[RAMM field name]\"),0),4)),\nMATCH(INDEX(INDIRECT($B$5&\"_\"&$C$5),ROW()-13,MATCH(INDEX(INDIRECT($B$5&\"_key\"),MATCH(AX$13,INDIRECT($B$5&\"_key[RAMM field name]\"),0),1),INDIRECT($B$5&\"_\"&$C$5&\"[#Headers]\"),0)),\nINDIRECT(INDEX(INDIRECT($B$5&\"_key\"),MATCH(AX$13,INDIRECT($B$5&\"_key[RAMM field name]\"),0),4)&\"[\"&INDEX(INDIRECT($B$5&\"_key\"),MATCH(AX$13,INDIRECT($B$5&\"_key[RAMM field name]\"),0),2)&\"]\"),0),1),\nINDEX(INDIRECT($B$5&\"_\"&$C$5),ROW()-13,MATCH(INDEX(INDIRECT($B$5&\"_key\"),MATCH(AX$13,INDIRECT($B$5&\"_key[RAMM field name]\"),0),1),INDIRECT($B$5&\"_\"&$C$5&\"[#Headers]\"),0))))","v":{"$error":"#REF!"}}]

{"sheet":"Generated Tables","index":1,"n_rows":3,"n_cols":26,"rows_kept":3,"cut":false,"hidden":false,"merged":[]}
[]
[null,"Tag","Road ID","Road Name","Asset Status","Location Description","Owner","Start","End","Length","Quantity","Side","Offset","Type","Colour","Reflectorised?","Material","Install Date","Cost","RUL","Condition","Risk Likelihood","Risk Consequence","Failure Risk","Default RC?","Notes"]
[null,null,{"$f":"IFERROR(IF(Markings_New[[#This Row],[Road Name]]=\"\",\"\",INDEX(road_name[],MATCH(Markings_New[[#This Row],[Road Name]],road_name[road_name],0),1)),\"\")","v":""},null,null,null,null,null,null,{"$f":"IFERROR(IF(Markings_New[[#This Row],[Road Name]]=\"\",\"\",Markings_New[End]-Markings_New[Start]),\"\")","v":""}]

{"sheet":"Template","index":2,"n_rows":3,"n_cols":6,"rows_kept":3,"cut":false,"hidden":false,"merged":[]}
[]
["Tag","Road ID","Road Name","Asset Status","Asset ID","Location Description"]
[null,{"$f":"IFERROR(IF(default[[#This Row],[Road Name]]=\"\",\"\",INDEX(road_name[],MATCH(default[[#This Row],[Road Name]],road_name[road_name],0),1)),\"\")","v":91319},"002-0116"]

{"sheet":"Instructions","index":3,"n_rows":28,"n_cols":2,"rows_kept":28,"cut":false,"hidden":false,"merged":[]}
[]
[null,"Project Summary Sheet"]
[]
[]
[]
[]
[]
[]
[]
[]
[]
[]
[]
[]
[]
[]
[]
[]
[]
[]
[]
[]
[]
[]
[]
[]
[]
[null,"Asset Data Sheets"]

{"sheet":"Project","index":4,"n_rows":42,"n_cols":15,"rows_kept":42,"cut":false,"hidden":false,"merged":[]}
[]
[]
[]
[]
[]
[]
[]
[null,"Project Details:",null,null,"Asset Data Summary:",null,null,null,null,null,"Database Structure:",null,"Lookups:"]
[]
[null,"Project Name",null,null,"Asset Type","Count","New","Upgrade","Removed",null,"Asset Table",null,"Show","Hide","Lookup"]
[null,"Contract/Consent Number",null,null,"Bridges",{"$f":"COUNTA(INDIRECT(data_summary[[#This Row],[Asset Type]]&\"[Road Name]\"))","v":0},{"$f":"COUNTIF(INDIRECT(data_summary[[#This Row],[Asset Type]]&\"[Asset Status]\"),\"=\"&data_summary[[#Headers],[New]]&\"\")","v":0},{"$f":"COUNTIF(INDIRECT(data_summary[[#This Row],[Asset Type]]&\"[Asset Status]\"),\"=\"&data_summary[[#Headers],[Upgrade]]&\"\")","v":0},{"$f":"COUNTIF(INDIRECT(data_summary[[#This Row],[Asset Type]]&\"[Asset Status]\"),\"=\"&data_summary[[#Headers],[Removed]]&\"\")","v":0},null,"Bridges",null,null,null,"General"]
[null,"Area",null,null,"Drainage",{"$f":"COUNTA(INDIRECT(data_summary[[#This Row],[Asset Type]]&\"[Road Name]\"))","v":0},{"$f":"COUNTIF(INDIRECT(data_summary[[#This Row],[Asset Type]]&\"[Asset Status]\"),\"=\"&data_summary[[#Headers],[New]]&\"\")","v":0},{"$f":"COUNTIF(INDIRECT(data_summary[[#This Row],[Asset Type]]&\"[Asset Status]\"),\"=\"&data_summary[[#Headers],[Upgrade]]&\"\")","v":0},{"$f":"COUNTIF(INDIRECT(data_summary[[#This Row],[Asset Type]]&\"[Asset Status]\"),\"=\"&data_summary[[#Headers],[Removed]]&\"\")","v":0},null,"Drainage",null,null,null,"Road Names"]
[null,null,null,null,"Features",{"$f":"COUNTA(INDIRECT(data_summary[[#This Row],[Asset Type]]&\"[Road Name]\"))","v":0},{"$f":"COUNTIF(INDIRECT(data_summary[[#This Row],[Asset Type]]&\"[Asset Status]\"),\"=\"&data_summary[[#Headers],[New]]&\"\")","v":0},{"$f":"COUNTIF(INDIRECT(data_summary[[#This Row],[Asset Type]]&\"[Asset Status]\"),\"=\"&data_summary[[#Headers],[Upgrade]]&\"\")","v":0},{"$f":"COUNTIF(INDIRECT(data_summary[[#This Row],[Asset Type]]&\"[Asset Status]\"),\"=\"&data_summary[[#Headers],[Removed]]&\"\")","v":0},null,"Features",null,null,null,"Surfacing"]
[null,"Contractor Name",null,null,"Footpaths",{"$f":"COUNTA(INDIRECT(data_summary[[#This Row],[Asset Type]]&\"[Road Name]\"))","v":0},{"$f":"COUNTIF(INDIRECT(data_summary[[#This Row],[Asset Type]]&\"[Asset Status]\"),\"=\"&data_summary[[#Headers],[New]]&\"\")","v":0},{"$f":"COUNTIF(INDIRECT(data_summary[[#This Row],[Asset Type]]&\"[Asset Status]\"),\"=\"&data_summary[[#Headers],[Upgrade]]&\"\")","v":0},{"$f":"COUNTIF(INDIRECT(data_summary[[#This Row],[Asset Type]]&\"[Asset Status]\"),\"=\"&data_summary[[#Headers],[Removed]]&\"\")","v":0},null,"Footpaths",null,null,null,"Sign"]
[null,"Contractor Organisation",null,null,"Islands",{"$f":"COUNTA(INDIRECT(data_summary[[#This Row],[Asset Type]]&\"[Road Name]\"))","v":0},{"$f":"COUNTIF(INDIRECT(data_summary[[#This Row],[Asset Type]]&\"[Asset Status]\"),\"=\"&data_summary[[#Headers],[New]]&\"\")","v":0},{"$f":"COUNTIF(INDIRECT(data_summary[[#This Row],[Asset Type]]&\"[Asset Status]\"),\"=\"&data_summary[[#Headers],[Upgrade]]&\"\")","v":0},{"$f":"COUNTIF(INDIRECT(data_summary[[#This Row],[Asset Type]]&\"[Asset Status]\"),\"=\"&data_summary[[#Headers],[Removed]]&\"\")","v":0},null,"Islands",null,null,null,"Pavement"]
[null,"Contractor Phone",null,null,"ITS",{"$f":"COUNTA(INDIRECT(data_summary[[#This Row],[Asset Type]]&\"[Road Name]\"))","v":0},{"$f":"COUNTIF(INDIRECT(data_summary[[#This Row],[Asset Type]]&\"[Asset Status]\"),\"=\"&data_summary[[#Headers],[New]]&\"\")","v":0},{"$f":"COUNTIF(INDIRECT(data_summary[[#This Row],[Asset Type]]&\"[Asset Status]\"),\"=\"&data_summary[[#Headers],[Upgrade]]&\"\")","v":0},{"$f":"COUNTIF(INDIRECT(data_summary[[#This Row],[Asset Type]]&\"[Asset Status]\"),\"=\"&data_summary[[#Headers],[Removed]]&\"\")","v":0},null,"ITS",null,null,null,"Markings"]
[null,null,null,null,"Markings",{"$f":"COUNTA(INDIRECT(data_summary[[#This Row],[Asset Type]]&\"[Road Name]\"))","v":0},{"$f":"COUNTIF(INDIRECT(data_summary[[#This Row],[Asset Type]]&\"[Asset Status]\"),\"=\"&data_summary[[#Headers],[New]]&\"\")","v":0},{"$f":"COUNTIF(INDIRECT(data_summary[[#This Row],[Asset Type]]&\"[Asset Status]\"),\"=\"&data_summary[[#Headers],[Upgrade]]&\"\")","v":0},{"$f":"COUNTIF(INDIRECT(data_summary[[#This Row],[Asset Type]]&\"[Asset Status]\"),\"=\"&data_summary[[#Headers],[Removed]]&\"\")","v":0},null,"Markings",null,null,null,"SW_Channel"]
[null,"Data Collector Name",null,null,"Minor_Structures",{"$f":"COUNTA(INDIRECT(data_summary[[#This Row],[Asset Type]]&\"[Road Name]\"))","v":0},{"$f":"COUNTIF(INDIRECT(data_summary[[#This Row],[Asset Type]]&\"[Asset Status]\"),\"=\"&data_summary[[#Headers],[New]]&\"\")","v":0},{"$f":"COUNTIF(INDIRECT(data_summary[[#This Row],[Asset Type]]&\"[Asset Status]\"),\"=\"&data_summary[[#Headers],[Upgrade]]&\"\")","v":0},{"$f":"COUNTIF(INDIRECT(data_summary[[#This Row],[Asset Type]]&\"[Asset Status]\"),\"=\"&data_summary[[#Headers],[Removed]]&\"\")","v":0},null,"Minor Structures",null,null,null,"Drainage"]
[null,"Data Collector Organisation",null,null,"Pavement",{"$f":"COUNTA(INDIRECT(data_summary[[#This Row],[Asset Type]]&\"[Road Name]\"))","v":0},{"$f":"COUNTIF(INDIRECT(data_summary[[#This Row],[Asset Type]]&\"[Asset Status]\"),\"=\"&data_summary[[#Headers],[New]]&\"\")","v":0},{"$f":"COUNTIF(INDIRECT(data_summary[[#This Row],[Asset Type]]&\"[Asset Status]\"),\"=\"&data_summary[[#Headers],[Upgrade]]&\"\")","v":0},{"$f":"COUNTIF(INDIRECT(data_summary[[#This Row],[Asset Type]]&\"[Asset Status]\"),\"=\"&data_summary[[#Headers],[Removed]]&\"\")","v":0},null,"Pavement",null,null,null,"Railings"]
[null,"Data Collector Phone",null,null,"Pavement_Test_Pit",{"$f":"COUNTA(INDIRECT(data_summary[[#This Row],[Asset Type]]&\"[Road Name]\"))","v":0},{"$f":"COUNTIF(INDIRECT(data_summary[[#This Row],[Asset Type]]&\"[Asset Status]\"),\"=\"&data_summary[[#Headers],[New]]&\"\")","v":0},{"$f":"COUNTIF(INDIRECT(data_summary[[#This Row],[Asset Type]]&\"[Asset Status]\"),\"=\"&data_summary[[#Headers],[Upgrade]]&\"\")","v":0},{"$f":"COUNTIF(INDIRECT(data_summary[[#This Row],[Asset Type]]&\"[Asset Status]\"),\"=\"&data_summary[[#Headers],[Removed]]&\"\")","v":0},null,"Pavement Test Pits",null,null,null,"Bridges"]
[null,null,null,null,"Railings",{"$f":"COUNTA(INDIRECT(data_summary[[#This Row],[Asset Type]]&\"[Road Name]\"))","v":0},{"$f":"COUNTIF(INDIRECT(data_summary[[#This Row],[Asset Type]]&\"[Asset Status]\"),\"=\"&data_summary[[#Headers],[New]]&\"\")","v":0},{"$f":"COUNTIF(INDIRECT(data_summary[[#This Row],[Asset Type]]&\"[Asset Status]\"),\"=\"&data_summary[[#Headers],[Upgrade]]&\"\")","v":0},{"$f":"COUNTIF(INDIRECT(data_summary[[#This Row],[Asset Type]]&\"[Asset Status]\"),\"=\"&data_summary[[#Headers],[Removed]]&\"\")","v":0},null,"Railings",null,null,null,"Features"]
[null,"WBOP DC Representative",null,null,"Retaining_Walls",{"$f":"COUNTA(INDIRECT(data_summary[[#This Row],[Asset Type]]&\"[Road Name]\"))","v":0},{"$f":"COUNTIF(INDIRECT(data_summary[[#This Row],[Asset Type]]&\"[Asset Status]\"),\"=\"&data_summary[[#Headers],[New]]&\"\")","v":0},{"$f":"COUNTIF(INDIRECT(data_summary[[#This Row],[Asset Type]]&\"[Asset Status]\"),\"=\"&data_summary[[#Headers],[Upgrade]]&\"\")","v":0},{"$f":"COUNTIF(INDIRECT(data_summary[[#This Row],[Asset Type]]&\"[Asset Status]\"),\"=\"&data_summary[[#Headers],[Removed]]&\"\")","v":0},null,"Retaining Walls",null,null,null,"Footpaths"]
[null,"Date",null,null,"Shoulders",{"$f":"COUNTA(INDIRECT(data_summary[[#This Row],[Asset Type]]&\"[Road Name]\"))","v":0},{"$f":"COUNTIF(INDIRECT(data_summary[[#This Row],[Asset Type]]&\"[Asset Status]\"),\"=\"&data_summary[[#Headers],[New]]&\"\")","v":0},{"$f":"COUNTIF(INDIRECT(data_summary[[#This Row],[Asset Type]]&\"[Asset Status]\"),\"=\"&data_summary[[#Headers],[Upgrade]]&\"\")","v":0},{"$f":"COUNTIF(INDIRECT(data_summary[[#This Row],[Asset Type]]&\"[Asset Status]\"),\"=\"&data_summary[[#Headers],[Removed]]&\"\")","v":0},null,"Shoulders",null,null,null,"Islands"]
[null,null,null,null,"Sign",{"$f":"COUNTA(INDIRECT(data_summary[[#This Row],[Asset Type]]&\"[Road Name]\"))","v":0},{"$f":"COUNTIF(INDIRECT(data_summary[[#This Row],[Asset Type]]&\"[Asset Status]\"),\"=\"&data_summary[[#Headers],[New]]&\"\")","v":0},{"$f":"COUNTIF(INDIRECT(data_summary[[#This Row],[Asset Type]]&\"[Asset Status]\"),\"=\"&data_summary[[#Headers],[Upgrade]]&\"\")","v":0},{"$f":"COUNTIF(INDIRECT(data_summary[[#This Row],[Asset Type]]&\"[Asset Status]\"),\"=\"&data_summary[[#Headers],[Removed]]&\"\")","v":0},null,"Sign",null,null,null,"ITS"]
[null,null,null,null,"SL_Bracket",{"$f":"COUNTA(INDIRECT(data_summary[[#This Row],[Asset Type]]&\"[Road Name]\"))","v":0},{"$f":"COUNTIF(INDIRECT(data_summary[[#This Row],[Asset Type]]&\"[Asset Status]\"),\"=\"&data_summary[[#Headers],[New]]&\"\")","v":0},{"$f":"COUNTIF(INDIRECT(data_summary[[#This Row],[Asset Type]]&\"[Asset Status]\"),\"=\"&data_summary[[#Headers],[Upgrade]]&\"\")","v":0},{"$f":"COUNTIF(INDIRECT(data_summary[[#This Row],[Asset Type]]&\"[Asset Status]\"),\"=\"&data_summary[[#Headers],[Removed]]&\"\")","v":0},null,"SL Bracket",null,null,null,"Streetlights"]
[null,null,null,null,"SL_Light",{"$f":"COUNTA(INDIRECT(data_summary[[#This Row],[Asset Type]]&\"[Road Name]\"))","v":0},{"$f":"COUNTIF(INDIRECT(data_summary[[#This Row],[Asset Type]]&\"[Asset Status]\"),\"=\"&data_summary[[#Headers],[New]]&\"\")","v":0},{"$f":"COUNTIF(INDIRECT(data_summary[[#This Row],[Asset Type]]&\"[Asset Status]\"),\"=\"&data_summary[[#Headers],[Upgrade]]&\"\")","v":0},{"$f":"COUNTIF(INDIRECT(data_summary[[#This Row],[Asset Type]]&\"[Asset Status]\"),\"=\"&data_summary[[#Headers],[Removed]]&\"\")","v":0},null,"SL Light",null,null,null,"Traf_Facil"]
[null,null,null,null,"SL_Pole",{"$f":"COUNTA(INDIRECT(data_summary[[#This Row],[Asset Type]]&\"[Road Name]\"))","v":0},{"$f":"COUNTIF(INDIRECT(data_summary[[#This Row],[Asset Type]]&\"[Asset Status]\"),\"=\"&data_summary[[#Headers],[New]]&\"\")","v":0},{"$f":"COUNTIF(INDIRECT(data_summary[[#This Row],[Asset Type]]&\"[Asset Status]\"),\"=\"&data_summary[[#Headers],[Upgrade]]&\"\")","v":0},{"$f":"COUNTIF(INDIRECT(data_summary[[#This Row],[Asset Type]]&\"[Asset Status]\"),\"=\"&data_summary[[#Headers],[Removed]]&\"\")","v":0},null,"SL Pole",null,null,null,"Retaining_Walls"]
[null,null,null,null,"Surfacing",{"$f":"COUNTA(INDIRECT(data_summary[[#This Row],[Asset Type]]&\"[Road Name]\"))","v":0},{"$f":"COUNTIF(INDIRECT(data_summary[[#This Row],[Asset Type]]&\"[Asset Status]\"),\"=\"&data_summary[[#Headers],[New]]&\"\")","v":0},{"$f":"COUNTIF(INDIRECT(data_summary[[#This Row],[Asset Type]]&\"[Asset Status]\"),\"=\"&data_summary[[#Headers],[Upgrade]]&\"\")","v":0},{"$f":"COUNTIF(INDIRECT(data_summary[[#This Row],[Asset Type]]&\"[Asset Status]\"),\"=\"&data_summary[[#Headers],[Removed]]&\"\")","v":0},null,"Surfacing",null,null,null,"Minor_Structures"]
[null,null,null,null,"SW_Channel",{"$f":"COUNTA(INDIRECT(data_summary[[#This Row],[Asset Type]]&\"[Road Name]\"))","v":0},{"$f":"COUNTIF(INDIRECT(data_summary[[#This Row],[Asset Type]]&\"[Asset Status]\"),\"=\"&data_summary[[#Headers],[New]]&\"\")","v":0},{"$f":"COUNTIF(INDIRECT(data_summary[[#This Row],[Asset Type]]&\"[Asset Status]\"),\"=\"&data_summary[[#Headers],[Upgrade]]&\"\")","v":0},{"$f":"COUNTIF(INDIRECT(data_summary[[#This Row],[Asset Type]]&\"[Asset Status]\"),\"=\"&data_summary[[#Headers],[Removed]]&\"\")","v":0},null,"SW_Channel"]
[null,null,null,null,"Trees",{"$f":"COUNTA(INDIRECT(data_summary[[#This Row],[Asset Type]]&\"[Road Name]\"))","v":0},{"$f":"COUNTIF(INDIRECT(data_summary[[#This Row],[Asset Type]]&\"[Asset Status]\"),\"=\"&data_summary[[#Headers],[New]]&\"\")","v":0},{"$f":"COUNTIF(INDIRECT(data_summary[[#This Row],[Asset Type]]&\"[Asset Status]\"),\"=\"&data_summary[[#Headers],[Upgrade]]&\"\")","v":0},{"$f":"COUNTIF(INDIRECT(data_summary[[#This Row],[Asset Type]]&\"[Asset Status]\"),\"=\"&data_summary[[#Headers],[Removed]]&\"\")","v":0},null,"Trees"]
[null,null,null,null,"Traffic_Facilities",{"$f":"COUNTA(INDIRECT(data_summary[[#This Row],[Asset Type]]&\"[Road Name]\"))","v":0},{"$f":"COUNTIF(INDIRECT(data_summary[[#This Row],[Asset Type]]&\"[Asset Status]\"),\"=\"&data_summary[[#Headers],[New]]&\"\")","v":0},{"$f":"COUNTIF(INDIRECT(data_summary[[#This Row],[Asset Type]]&\"[Asset Status]\"),\"=\"&data_summary[[#Headers],[Upgrade]]&\"\")","v":0},{"$f":"COUNTIF(INDIRECT(data_summary[[#This Row],[Asset Type]]&\"[Asset Status]\"),\"=\"&data_summary[[#Headers],[Removed]]&\"\")","v":0},null,"Traf_Facil"]
[]
[]
[]
[]
[]
[]
[]
[]
[]
[]
[null,null,null,null,"Note: The asset types coloured orange are WIP and may not have full lookups"]

{"sheet":"Association Table","index":5,"n_rows":677,"n_cols":16,"rows_kept":677,"cut":false,"hidden":false,"merged":[]}
["Surfacing"]
["Column Name","RAMM field name","Data Type","Lookup Table","1","Required by Software","Generated Value","Required by NZTA","Factor","Factor Address","Condition","2","Field Description","Allowable Values","Data Collection Notes","Database Management Guidance Notes"]
["Road ID","road_id","number",null,1,"Y",null,"Mandatory",null,{"$f":"IF(surfacing_key[[#This Row],[Factor]]=\"\",\"\",COLUMN(INDIRECT($A$1&$I3)))","v":""},null,null,"road_id is the RAMM road_id of the road that the asset is on","Looks up on roadnames","Automatically generated from the roadname given, please provide the full roadname. Otherwise, see the RAMM carriageway table for full list.","Ensure that the road_id provided on the RAMM update sheet correlates with the road name shown on the carriageway list"]
["Owner","asset_owner","lookup","asset_owner",null,null,null,"Mandatory",null,{"$f":"IF(surfacing_key[[#This Row],[Factor]]=\"\",\"\",COLUMN(INDIRECT($A$1&$I4)))","v":""}]
["Start","start_m","number",null,1,"Y",null,"Mandatory",null,{"$f":"IF(surfacing_key[[#This Row],[Factor]]=\"\",\"\",COLUMN(INDIRECT($A$1&$I5)))","v":""}]
["End","end_m","number",null,1,"Y",null,"Mandatory",null,{"$f":"IF(surfacing_key[[#This Row],[Factor]]=\"\",\"\",COLUMN(INDIRECT($A$1&$I6)))","v":""}]
["Start Name","start_name","text",null,0,null,null,null,null,{"$f":"IF(surfacing_key[[#This Row],[Factor]]=\"\",\"\",COLUMN(INDIRECT($A$1&$I7)))","v":""}]
["End Name","end_name","text",null,0,null,null,null,null,{"$f":"IF(surfacing_key[[#This Row],[Factor]]=\"\",\"\",COLUMN(INDIRECT($A$1&$I8)))","v":""}]
["Offset","surf_offset","number",null,1,"Y",0,"Mandatory",null,{"$f":"IF(surfacing_key[[#This Row],[Factor]]=\"\",\"\",COLUMN(INDIRECT($A$1&$I9)))","v":""}]
["Width","surf_width","number",null,1,null,null,"Mandatory",null,{"$f":"IF(surfacing_key[[#This Row],[Factor]]=\"\",\"\",COLUMN(INDIRECT($A$1&$I10)))","v":""}]
["Total Sealed Area","sealed_area","auto",null,1,null,null,"Mandatory",null,{"$f":"IF(surfacing_key[[#This Row],[Factor]]=\"\",\"\",COLUMN(INDIRECT($A$1&$I11)))","v":""}]
["Sealed Area Ok?","sealed_area_ok","boolean","y_n",1,"Y","Y","Mandatory",null,{"$f":"IF(surfacing_key[[#This Row],[Factor]]=\"\",\"\",COLUMN(INDIRECT($A$1&$I12)))","v":""}]
["Depth","surf_depth","number",null,1,"Y",0,"Mandatory",null,{"$f":"IF(surfacing_key[[#This Row],[Factor]]=\"\",\"\",COLUMN(INDIRECT($A$1&$I13)))","v":""}]
["Surface Material","surf_material","lookup","surf_material",1,"Y",null,"Mandatory",null,{"$f":"IF(surfacing_key[[#This Row],[Factor]]=\"\",\"\",COLUMN(INDIRECT($A$1&$I14)))","v":""}]
["Surface Date","surface_date","date",null,1,"Y",null,"Mandatory",null,{"$f":"IF(surfacing_key[[#This Row],[Factor]]=\"\",\"\",COLUMN(INDIRECT($A$1&$I15)))","v":""}]
["Removed Date","removed_date","date",null,1,null,null,"Conditional","[Asset Status]",{"$f":"IF(surfacing_key[[#This Row],[Factor]]=\"\",\"\",COLUMN(INDIRECT($A$1&$I16)))","v":4},"=\"removed\""]
["Full Width Flag","full_width_flag","boolean","y_n",1,"Y","Y","Optional",null,{"$f":"IF(surfacing_key[[#This Row],[Factor]]=\"\",\"\",COLUMN(INDIRECT($A$1&$I17)))","v":""}]
["Lane Coverage","lane_coverage","number",null,1,null,null,"Mandatory",null,{"$f":"IF(surfacing_key[[#This Row],[Factor]]=\"\",\"\",COLUMN(INDIRECT($A$1&$I18)))","v":""}]
["Surface Function","surf_function","lookup","surf_function",1,"Y",null,"Mandatory",null,{"$f":"IF(surfacing_key[[#This Row],[Factor]]=\"\",\"\",COLUMN(INDIRECT($A$1&$I19)))","v":""}]
["Use Calc Depth","use_calc_depth","auto",null,1,"Y","Y","Mandatory",null,{"$f":"IF(surfacing_key[[#This Row],[Factor]]=\"\",\"\",COLUMN(INDIRECT($A$1&$I20)))","v":""}]
["1st Chip Size","chip_size","number",null,1,"Y",null,"Mandatory",null,{"$f":"IF(surfacing_key[[#This Row],[Factor]]=\"\",\"\",COLUMN(INDIRECT($A$1&$I21)))","v":""}]
["2nd Chip Size","chip_2nd_size","number",null,1,null,null,"Optional",null,{"$f":"IF(surfacing_key[[#This Row],[Factor]]=\"\",\"\",COLUMN(INDIRECT($A$1&$I22)))","v":""}]
["Source","pave_source","lookup","pave_source",1,null,null,"Mandatory",null,{"$f":"IF(surfacing_key[[#This Row],[Factor]]=\"\",\"\",COLUMN(INDIRECT($A$1&$I23)))","v":""}]
["Binder Type","surf_binder","lookup","surf_binder",1,"Y",null,"Mandatory",null,{"$f":"IF(surfacing_key[[#This Row],[Factor]]=\"\",\"\",COLUMN(INDIRECT($A$1&$I24)))","v":""}]
["Flux Amount","flux","number",null,1,"Y",0,"Mandatory",null,{"$f":"IF(surfacing_key[[#This Row],[Factor]]=\"\",\"\",COLUMN(INDIRECT($A$1&$I25)))","v":""}]
["Cutter Amount","cutter","number",null,1,"Y",0,"Mandatory",null,{"$f":"IF(surfacing_key[[#This Row],[Factor]]=\"\",\"\",COLUMN(INDIRECT($A$1&$I26)))","v":""}]
["Cutter Type","cutter_type","lookup","cut_type",1,null,null,"Conditional","[Cutter Amount]",{"$f":"IF(surfacing_key[[#This Row],[Factor]]=\"\",\"\",COLUMN(INDIRECT($A$1&$I27)))","v":30},"<>0"]
["Adhesion Amount","adhesion","number",null,1,"Y",0,"Mandatory",null,{"$f":"IF(surfacing_key[[#This Row],[Factor]]=\"\",\"\",COLUMN(INDIRECT($A$1&$I28)))","v":""}]
["Adhesion Type","surf_adhesion","lookup","surf_adhesion",1,null,null,"Conditional","[Adhesion Amount]",{"$f":"IF(surfacing_key[[#This Row],[Factor]]=\"\",\"\",COLUMN(INDIRECT($A$1&$I29)))","v":32},"<>0"]
["Additive Amount","additive","number",null,1,"Y",0,"Mandatory",null,{"$f":"IF(surfacing_key[[#This Row],[Factor]]=\"\",\"\",COLUMN(INDIRECT($A$1&$I30)))","v":""}]
["Additive Type","surf_additive","lookup","surf_additive",1,null,null,"Conditional","[Additive Amount]",{"$f":"IF(surfacing_key[[#This Row],[Factor]]=\"\",\"\",COLUMN(INDIRECT($A$1&$I31)))","v":34},"<>0"]
["Polymer Type","polymer_type","lookup","polymer_type",1,null,null,"Optional",null,{"$f":"IF(surfacing_key[[#This Row],[Factor]]=\"\",\"\",COLUMN(INDIRECT($A$1&$I32)))","v":""}]
["Polymer Mod %","polymer_mod_pcnt","number",null,1,null,null,"Conditional","[Polymer Type]",{"$f":"IF(surfacing_key[[#This Row],[Factor]]=\"\",\"\",COLUMN(INDIRECT($A$1&$I33)))","v":36},"<>\"\""]
["Torsional Recovery","elastic_recovery","number",null,1,null,null,"Conditional","[Polymer Type]",{"$f":"IF(surfacing_key[[#This Row],[Factor]]=\"\",\"\",COLUMN(INDIRECT($A$1&$I34)))","v":36},"<>\"\""]
["Softening Point","softening_point","number",null,1,null,null,"Conditional","[Polymer Type]",{"$f":"IF(surfacing_key[[#This Row],[Factor]]=\"\",\"\",COLUMN(INDIRECT($A$1&$I35)))","v":36},"<>\"\""]
["Residual Rate","rate","number",null,1,null,null,"Conditional","[Surface Material Type]",{"$f":"IF(surfacing_key[[#This Row],[Factor]]=\"\",\"\",COLUMN(INDIRECT($A$1&$I36)))","v":19},"<=3"]
["Contract Number","contract_number","text",null,1,null,null,"Mandatory",null,{"$f":"IF(surfacing_key[[#This Row],[Factor]]=\"\",\"\",COLUMN(INDIRECT($A$1&$I37)))","v":""}]
["Organisation","organisation","lookup","organisation",1,null,null,"Mandatory",null,{"$f":"IF(surfacing_key[[#This Row],[Factor]]=\"\",\"\",COLUMN(INDIRECT($A$1&$I38)))","v":""}]
["Specification Type","surf_spec","lookup","surf_spec",1,null,null,"Mandatory",null,{"$f":"IF(surfacing_key[[#This Row],[Factor]]=\"\",\"\",COLUMN(INDIRECT($A$1&$I39)))","v":""}]
["PSV","polished_stone","number",null,1,null,null,"Conditional","[Surface Material Type]",{"$f":"IF(surfacing_key[[#This Row],[Factor]]=\"\",\"\",COLUMN(INDIRECT($A$1&$I40)))","v":19},"<>4"]
["ALD","average_dim","number",null,1,null,null,"Conditional","[Surface Material Type]",{"$f":"IF(surfacing_key[[#This Row],[Factor]]=\"\",\"\",COLUMN(INDIRECT($A$1&$I41)))","v":19},"<=3"]
["Recycling","recycling","boolean","t_f",1,"Y",false,"Mandatory",null,{"$f":"IF(surfacing_key[[#This Row],[Factor]]=\"\",\"\",COLUMN(INDIRECT($A$1&$I42)))","v":""}]
["Recycling Component Type","surf_recycled_cpnt","lookup","surf_recycled_cpnt",1,null,null,"Conditional","[Recycling]",{"$f":"IF(surfacing_key[[#This Row],[Factor]]=\"\",\"\",COLUMN(INDIRECT($A$1&$I43)))","v":46},"=TRUE"]
["Component %","pct_recycled","number",null,1,null,null,"Conditional","[Recycling]",{"$f":"IF(surfacing_key[[#This Row],[Factor]]=\"\",\"\",COLUMN(INDIRECT($A$1&$I44)))","v":46},"=TRUE"]
["Reason","surf_reason","lookup","surf_reason",1,null,null,"Mandatory",null,{"$f":"IF(surfacing_key[[#This Row],[Factor]]=\"\",\"\",COLUMN(INDIRECT($A$1&$I45)))","v":""}]
["Work Origin","work_origin_id","lookup","fund_work_origin",1,null,null,"Mandatory",null,{"$f":"IF(surfacing_key[[#This Row],[Factor]]=\"\",\"\",COLUMN(INDIRECT($A$1&$I46)))","v":""}]
["Life","design_life","number",null,1,null,null,"Mandatory",null,{"$f":"IF(surfacing_key[[#This Row],[Factor]]=\"\",\"\",COLUMN(INDIRECT($A$1&$I47)))","v":""}]
["Cost","original_cost","number",null,1,null,null,"Mandatory",null,{"$f":"IF(surfacing_key[[#This Row],[Factor]]=\"\",\"\",COLUMN(INDIRECT($A$1&$I48)))","v":""}]
["Notes","notes","text",null,1,null,null,"Conditional","[Reason]",{"$f":"IF(surfacing_key[[#This Row],[Factor]]=\"\",\"\",COLUMN(INDIRECT($A$1&$I49)))","v":49},"=\"Special Surfacings (reason req'd)\""]
["Condition","condition","lookup","condition",1,"Y","U","Optional",null,{"$f":"IF(surfacing_key[[#This Row],[Factor]]=\"\",\"\",COLUMN(INDIRECT($A$1&$I50)))","v":""}]
["Default RC?","use_default_rc","boolean","d_u",1,"Y","D","Optional",null,{"$f":"IF(surfacing_key[[#This Row],[Factor]]=\"\",\"\",COLUMN(INDIRECT($A$1&$I51)))","v":""}]
["Northing","northing","number",null,null,null,null,"Optional",null,{"$f":"IF(surfacing_key[[#This Row],[Factor]]=\"\",\"\",COLUMN(INDIRECT($A$1&$I52)))","v":""}]
["Easting","easting","number",null,null,null,null,"Optional",null,{"$f":"IF(surfacing_key[[#This Row],[Factor]]=\"\",\"\",COLUMN(INDIRECT($A$1&$I53)))","v":""}]
["Northing End","northing_end","number",null,null,null,null,"Optional",null,{"$f":"IF(surfacing_key[[#This Row],[Factor]]=\"\",\"\",COLUMN(INDIRECT($A$1&$I54)))","v":""}]
["Easting End","east_end","number",null,null,null,null,"Optional",null,{"$f":"IF(surfacing_key[[#This Row],[Factor]]=\"\",\"\",COLUMN(INDIRECT($A$1&$I55)))","v":""}]
["GPS Collected Date","gps_date","date",null,null,null,null,"Optional",null,{"$f":"IF(surfacing_key[[#This Row],[Factor]]=\"\",\"\",COLUMN(INDIRECT($A$1&$I56)))","v":""}]
["GPS Collected By","gps_by","lookup","organisation",null,null,null,"Optional",null,{"$f":"IF(surfacing_key[[#This Row],[Factor]]=\"\",\"\",COLUMN(INDIRECT($A$1&$I57)))","v":""}]
["GPS Method","gps_method_id","text",null,null,null,null,"Optional",null,{"$f":"IF(surfacing_key[[#This Row],[Factor]]=\"\",\"\",COLUMN(INDIRECT($A$1&$I58)))","v":""}]
["Expected Life","ru_life","number",null,null,null,null,"Optional",null,{"$f":"IF(surfacing_key[[#This Row],[Factor]]=\"\",\"\",COLUMN(INDIRECT($A$1&$I59)))","v":""}]
["RUL","rul_reset","lookup","rul_reset",null,"Y","N","Optional",null,{"$f":"IF(surfacing_key[[#This Row],[Factor]]=\"\",\"\",COLUMN(INDIRECT($A$1&$I60)))","v":""}]
["Activity","activity","text",null,null,null,null,"Optional",null,{"$f":"IF(surfacing_key[[#This Row],[Factor]]=\"\",\"\",COLUMN(INDIRECT($A$1&$I61)))","v":""}]
["Sign"]
["Column Name","RAMM field name","Data Type","Lookup Table","1","Required by Software","Generated Value","Required by NZTA","Factor","Factor Address","Condition","2","Field Description","Allowable Values","Data Collection Notes","Database Management Guidance Notes"]
["Road ID","road_id","number",null,null,"Y",null,"Mandatory",null,{"$f":"IF(sign_key[[#This Row],[Factor]]=\"\",\"\",COLUMN(INDIRECT($A$62&$I64)))","v":""},null,null,"road_id is the RAMM road_id of the road that the asset is on","Looks up on roadnames","Automatically generated from the roadname given, please provide the full roadname. Otherwise, see the RAMM carriageway table for full list.","Ensure that the road_id provided on the RAMM update sheet correlates with the road name shown on the carriageway list"]
["Number of Posts","post_count","number",null,null,"Y",0,"Optional",null,{"$f":"IF(sign_key[[#This Row],[Factor]]=\"\",\"\",COLUMN(INDIRECT($A$62&$I65)))","v":""},null,null,"Number of posts","Integer between 1 & 32000","Typically set to 1"]
["Class","sign_class","lookup","sign_class",null,"Y",null,"Optional",null,{"$f":"IF(sign_key[[#This Row],[Factor]]=\"\",\"\",COLUMN(INDIRECT($A$62&$I66)))","v":""},null,null,"sign_class is the classification of the sign (MOTSAM)","See the sign_class table"]
["Type","sign_type","lookup","sign_type",null,"Y",null,"Mandatory",null,{"$f":"IF(sign_key[[#This Row],[Factor]]=\"\",\"\",COLUMN(INDIRECT($A$62&$I67)))","v":""},null,null,"sign_type is the sign type code (MOTSAM)","Looks up on sign_type","Refer to MOTSAM for sign type codes"]
["Location","location","number",null,null,null,null,"Mandatory",null,{"$f":"IF(sign_key[[#This Row],[Factor]]=\"\",\"\",COLUMN(INDIRECT($A$62&$I68)))","v":""},null,null,"location is the displacement in metres from the road origin (RP)","Within road boundaries","Use either a calibrated measuring wheel or vehicle tripmeter to collect location. Use mobile roads for an estimate.","When adding signs, it is considered best practice to review the adjacent signs to ensure the possibility of data duplication is reduced"]
["Side","side","lookup","side",null,"Y",null,"Mandatory",null,{"$f":"IF(sign_key[[#This Row],[Factor]]=\"\",\"\",COLUMN(INDIRECT($A$62&$I69)))","v":""},null,null,"side is defined as the side of the road that the asset is located on","C-Centre, L-Left, R-Right, U-Unknown","The left side of the road is on your left when you are looking in the increasing direction of the road.  Avoid the use of Unknown","Avoid use of Unknown if possible"]
["Offset","offset","number",null,null,null,null,"Mandatory",null,{"$f":"IF(sign_key[[#This Row],[Factor]]=\"\",\"\",COLUMN(INDIRECT($A$62&$I70)))","v":""},null,null,"Distance from road centreline to sign in metres","Between 0 & 120.0 or is null",null,"Defined as either 0, 6, or 15m"]
["Quantity","quantity","number",null,null,"Y",1,"Mandatory",null,{"$f":"IF(sign_key[[#This Row],[Factor]]=\"\",\"\",COLUMN(INDIRECT($A$62&$I71)))","v":""},null,null,"quantity is the number in section of this sign type (multiple signs only)","Integer between 1 & 32000","Typically set to 1"]
["Road Speed Record Status","latest","lookup","latest",null,"Y","N","Optional",null,{"$f":"IF(sign_key[[#This Row],[Factor]]=\"\",\"\",COLUMN(INDIRECT($A$62&$I72)))","v":""}]
["Direction","indicating_dir","lookup","direction",null,"Y","N","Optional",null,{"$f":"IF(sign_key[[#This Row],[Factor]]=\"\",\"\",COLUMN(INDIRECT($A$62&$I73)))","v":""}]
["Owner","sign_owner","lookup","sign_owner",null,null,null,"Mandatory",null,{"$f":"IF(sign_key[[#This Row],[Factor]]=\"\",\"\",COLUMN(INDIRECT($A$62&$I74)))","v":""}]
["Legend","legend_note","text",null,null,"Y",null,"Mandatory",null,{"$f":"IF(sign_key[[#This Row],[Factor]]=\"\",\"\",COLUMN(INDIRECT($A$62&$I75)))","v":""},null,null,"sign legend (written text) facing the increasing direction","text","Collect what is physically written on the sign. Symbols should be indicated as such e.g. [School bus symbol]. Supplementary signs are written as [main sign] + [supplementary text]"]
["Reverse Legend","legend2_note","text",null,null,null,null,"Optional",null,{"$f":"IF(sign_key[[#This Row],[Factor]]=\"\",\"\",COLUMN(INDIRECT($A$62&$I76)))","v":""},null,null,"sign Legend facing decreasing direction","text","Collect what is physically written on the sign. Symbols should be indicated as such e.g. [School bus symbol]. Supplementary signs are written as [main sign] + [supplementary text]"]
["Legend Material","legend_material","lookup","sign_material",null,"Y",null,"Mandatory",null,{"$f":"IF(sign_key[[#This Row],[Factor]]=\"\",\"\",COLUMN(INDIRECT($A$62&$I77)))","v":""},null,null,"The material the legend (text) is made of",null,"Black legends are typically non-reflective"]
["Legend Colour","legend_colour","lookup","sign_colour",null,"Y",null,"Mandatory",null,{"$f":"IF(sign_key[[#This Row],[Factor]]=\"\",\"\",COLUMN(INDIRECT($A$62&$I78)))","v":""},null,null,"The colour of the legend (text)"]
["Background Material","bground_material","lookup","sign_material",null,"Y",null,"Mandatory",null,{"$f":"IF(sign_key[[#This Row],[Factor]]=\"\",\"\",COLUMN(INDIRECT($A$62&$I79)))","v":""},null,null,"The material the background is made of"]
["Background Colour","bground_colour","lookup","sign_colour",null,"Y",null,"Mandatory",null,{"$f":"IF(sign_key[[#This Row],[Factor]]=\"\",\"\",COLUMN(INDIRECT($A$62&$I80)))","v":""},null,null,"The colour of the background"]
["Substrate","sign_substrate","lookup","sign_substrate",null,"Y","UN","Optional",null,{"$f":"IF(sign_key[[#This Row],[Factor]]=\"\",\"\",COLUMN(INDIRECT($A$62&$I81)))","v":""},null,null,"The material of the sign base"]
["Width","sign_width","number",null,null,null,null,"Mandatory",null,{"$f":"IF(sign_key[[#This Row],[Factor]]=\"\",\"\",COLUMN(INDIRECT($A$62&$I82)))","v":""},null,null,"Sign width in mm",null,"Needs to be field measured, or received from supplier"]
["Height","sign_height","number",null,null,null,null,"Mandatory",null,{"$f":"IF(sign_key[[#This Row],[Factor]]=\"\",\"\",COLUMN(INDIRECT($A$62&$I83)))","v":""},null,null,"Sign height in mm",null,"Needs to be field measured, or received from supplier"]
["Frame","frame","lookup","sign_frame",null,"Y","N","Optional",null,{"$f":"IF(sign_key[[#This Row],[Factor]]=\"\",\"\",COLUMN(INDIRECT($A$62&$I84)))","v":""}]
["Install Date","install_date","date",null,null,null,null,"Mandatory",null,{"$f":"IF(sign_key[[#This Row],[Factor]]=\"\",\"\",COLUMN(INDIRECT($A$62&$I85)))","v":""},null,null,"Date the sign was installed",null,"This can usually be found on the back of the sign for an existing sign or the date you are installing it for a new sign"]
["Reason","in_replace_reason","lookup","sig_replace_reason",null,null,null,"Mandatory",null,{"$f":"IF(sign_key[[#This Row],[Factor]]=\"\",\"\",COLUMN(INDIRECT($A$62&$I86)))","v":""},null,null,"Reason the sign was installed"]
["Replace Date","replace_date","date",null,null,null,null,"Conditional","[Asset Status]",{"$f":"IF(sign_key[[#This Row],[Factor]]=\"\",\"\",COLUMN(INDIRECT($A$62&$I87)))","v":4},"=\"upgrade\""]
["Replace Reason","rep_replace_reason","lookup","sig_replace_reason",null,null,null,"Conditional","[Replace Date]",{"$f":"IF(sign_key[[#This Row],[Factor]]=\"\",\"\",COLUMN(INDIRECT($A$62&$I88)))","v":26},"<>0"]
["RUL","rul_reset","lookup","rul_reset",null,"Y","N","Optional",null,{"$f":"IF(sign_key[[#This Row],[Factor]]=\"\",\"\",COLUMN(INDIRECT($A$62&$I89)))","v":""}]
["Condition","condition","lookup","condition",null,"Y","U","Optional",null,{"$f":"IF(sign_key[[#This Row],[Factor]]=\"\",\"\",COLUMN(INDIRECT($A$62&$I90)))","v":""}]
["Risk Likelihood","risk_likelihood","lookup","likelihood",null,"Y","U","Mandatory",null,{"$f":"IF(sign_key[[#This Row],[Factor]]=\"\",\"\",COLUMN(INDIRECT($A$62&$I91)))","v":""}]
["Risk Consequence","risk_consequence","lookup","consequence",null,"Y","U","Mandatory",null,{"$f":"IF(sign_key[[#This Row],[Factor]]=\"\",\"\",COLUMN(INDIRECT($A$62&$I92)))","v":""}]
["Failure Risk","risk","lookup","risk",null,"Y","U","Optional",null,{"$f":"IF(sign_key[[#This Row],[Factor]]=\"\",\"\",COLUMN(INDIRECT($A$62&$I93)))","v":""}]
["Default RC?","use_default_rc","boolean","d_u",null,"Y","D","Mandatory",null,{"$f":"IF(sign_key[[#This Row],[Factor]]=\"\",\"\",COLUMN(INDIRECT($A$62&$I94)))","v":""}]
["Cost","original_cost","number",null,null,null,null,"Mandatory",null,{"$f":"IF(sign_key[[#This Row],[Factor]]=\"\",\"\",COLUMN(INDIRECT($A$62&$I95)))","v":""}]
["Notes","general_note","text",null,null,null,null,"Optional",null,{"$f":"IF(sign_key[[#This Row],[Factor]]=\"\",\"\",COLUMN(INDIRECT($A$62&$I96)))","v":""},null,null,"General notes/comments about the asset",null,"Add in any comments that are particular to the asset or component that is not adequately described by existing fields","Try not to place too many items in this field as they are not easily searchable"]
["Markings"]
["Column Name","RAMM field name","Data Type","Lookup Table","Column1","Required by Software","Generated Value","Required by NZTA","Factor","Factor Address","Condition","Column2","Field Description","Allowable Values","Data Collection Notes","Database Management Guidance Notes"]
["Road ID","road_id","number",null,null,"Y",null,"Mandatory",null,{"$f":"IF(markings_key[[#This Row],[Factor]]=\"\",\"\",COLUMN(INDIRECT($A$97&$I99)))","v":""}]
["Owner","asset_owner","lookup","asset_owner",null,null,null,"Mandatory",null,{"$f":"IF(markings_key[[#This Row],[Factor]]=\"\",\"\",COLUMN(INDIRECT($A$97&$I100)))","v":""}]
["Start","start_m","number",null,null,"Y",null,"Mandatory",null,{"$f":"IF(markings_key[[#This Row],[Factor]]=\"\",\"\",COLUMN(INDIRECT($A$97&$I101)))","v":""}]
["End","end_m","number",null,null,null,null,"Mandatory",null,{"$f":"IF(markings_key[[#This Row],[Factor]]=\"\",\"\",COLUMN(INDIRECT($A$97&$I102)))","v":""}]
["Length","length_m","auto",null,null,null,null,"Mandatory",null,{"$f":"IF(markings_key[[#This Row],[Factor]]=\"\",\"\",COLUMN(INDIRECT($A$97&$I103)))","v":""}]
["Quantity","quantity","number",null,null,"Y",1,"Optional",null,{"$f":"IF(markings_key[[#This Row],[Factor]]=\"\",\"\",COLUMN(INDIRECT($A$97&$I104)))","v":""}]
["Side","side","lookup","side",null,"Y",null,"Mandatory",null,{"$f":"IF(markings_key[[#This Row],[Factor]]=\"\",\"\",COLUMN(INDIRECT($A$97&$I105)))","v":""}]
["Offset","offset","number",null,null,null,null,"Mandatory",null,{"$f":"IF(markings_key[[#This Row],[Factor]]=\"\",\"\",COLUMN(INDIRECT($A$97&$I106)))","v":""}]
["Type","marking_type","lookup","marking_type",null,"Y",null,"Mandatory",null,{"$f":"IF(markings_key[[#This Row],[Factor]]=\"\",\"\",COLUMN(INDIRECT($A$97&$I107)))","v":""}]
["Colour","marking_colour","lookup","marking_colour",null,null,null,"Mandatory",null,{"$f":"IF(markings_key[[#This Row],[Factor]]=\"\",\"\",COLUMN(INDIRECT($A$97&$I108)))","v":""}]
["Reflectorised?","reflectorised","lookup","reflectorised",null,null,null,"Mandatory",null,{"$f":"IF(markings_key[[#This Row],[Factor]]=\"\",\"\",COLUMN(INDIRECT($A$97&$I109)))","v":""}]
["Material","marking_material","lookup","marking_material",null,null,null,"Mandatory",null,{"$f":"IF(markings_key[[#This Row],[Factor]]=\"\",\"\",COLUMN(INDIRECT($A$97&$I110)))","v":""}]
["Install Date","painted_date","date",null,null,null,null,"Mandatory",null,{"$f":"IF(markings_key[[#This Row],[Factor]]=\"\",\"\",COLUMN(INDIRECT($A$97&$I111)))","v":""}]
["Cost","original_cost","number",null,null,null,null,"Mandatory",null,{"$f":"IF(markings_key[[#This Row],[Factor]]=\"\",\"\",COLUMN(INDIRECT($A$97&$I112)))","v":""}]
["RUL","rul_reset","lookup","rul_reset",null,"Y","N","Optional",null,{"$f":"IF(markings_key[[#This Row],[Factor]]=\"\",\"\",COLUMN(INDIRECT($A$97&$I113)))","v":""}]
["Condition","condition","lookup","condition",null,"Y","U","Optional",null,{"$f":"IF(markings_key[[#This Row],[Factor]]=\"\",\"\",COLUMN(INDIRECT($A$97&$I114)))","v":""}]
["Risk Likelihood","risk_likelihood","lookup","likelihood",null,"Y","U","Mandatory",null,{"$f":"IF(markings_key[[#This Row],[Factor]]=\"\",\"\",COLUMN(INDIRECT($A$97&$I115)))","v":""}]
["Risk Consequence","risk_consequence","lookup","consequence",null,"Y","U","Mandatory",null,{"$f":"IF(markings_key[[#This Row],[Factor]]=\"\",\"\",COLUMN(INDIRECT($A$97&$I116)))","v":""}]
["Failure Risk","risk","lookup","risk",null,"Y","U","Optional",null,{"$f":"IF(markings_key[[#This Row],[Factor]]=\"\",\"\",COLUMN(INDIRECT($A$97&$I117)))","v":""}]
["Default RC?","use_default_rc","boolean","d_u",null,"Y","D","Optional",null,{"$f":"IF(markings_key[[#This Row],[Factor]]=\"\",\"\",COLUMN(INDIRECT($A$97&$I118)))","v":""}]
["Notes","notes","text",null,null,null,null,"Optional",null,{"$f":"IF(markings_key[[#This Row],[Factor]]=\"\",\"\",COLUMN(INDIRECT($A$97&$I119)))","v":""}]
["Pavement"]
["Column Name","RAMM field name","Data Type","Lookup Table","Column1","Required by Software","Generated Value","Required by NZTA","Factor","Factor Address","Condition","Column2","Field Description","Allowable Values","Data Collection Notes","Database Management Guidance Notes"]
["Road ID","road_id","number",null,null,"Y",null,"Mandatory",null,{"$f":"IF(pavement_key[[#This Row],[Factor]]=\"\",\"\",COLUMN(INDIRECT($A$120&$I122)))","v":""}]
["Start","start_m","number",null,null,"Y",null,"Mandatory",null,{"$f":"IF(pavement_key[[#This Row],[Factor]]=\"\",\"\",COLUMN(INDIRECT($A$120&$I123)))","v":""}]
["End","end_m","number",null,null,"Y",null,"Mandatory",null,{"$f":"IF(pavement_key[[#This Row],[Factor]]=\"\",\"\",COLUMN(INDIRECT($A$120&$I124)))","v":""}]
["Layer or Subgrade?","layer_subgrade","lookup","layer_subgrade",null,"Y","L","Mandatory",null,{"$f":"IF(pavement_key[[#This Row],[Factor]]=\"\",\"\",COLUMN(INDIRECT($A$120&$I125)))","v":""}]
["Layer Date","layer_date","date",null,null,"Y",null,"Mandatory",null,{"$f":"IF(pavement_key[[#This Row],[Factor]]=\"\",\"\",COLUMN(INDIRECT($A$120&$I126)))","v":""}]
["Offset","offset","number",null,null,null,0,"Mandatory",null,{"$f":"IF(pavement_key[[#This Row],[Factor]]=\"\",\"\",COLUMN(INDIRECT($A$120&$I127)))","v":""}]
["Width","width","number",null,null,null,null,"Mandatory",null,{"$f":"IF(pavement_key[[#This Row],[Factor]]=\"\",\"\",COLUMN(INDIRECT($A$120&$I128)))","v":""}]
["Full Width Flag","full_width_flag","boolean","y_n",null,"Y","N","Mandatory",null,{"$f":"IF(pavement_key[[#This Row],[Factor]]=\"\",\"\",COLUMN(INDIRECT($A$120&$I129)))","v":""}]
["Data Status","estimate_status","boolean","e_k",null,"Y","K","Mandatory",null,{"$f":"IF(pavement_key[[#This Row],[Factor]]=\"\",\"\",COLUMN(INDIRECT($A$120&$I130)))","v":""}]
["Strength","layer_strength","number",null,null,null,null,"Mandatory",null,{"$f":"IF(pavement_key[[#This Row],[Factor]]=\"\",\"\",COLUMN(INDIRECT($A$120&$I131)))","v":""}]
["CBR or UCS?","cbr_ucs","lookup","cbr_ucs",null,"Y","C","Mandatory",null,{"$f":"IF(pavement_key[[#This Row],[Factor]]=\"\",\"\",COLUMN(INDIRECT($A$120&$I132)))","v":""}]
["Subgrade Material","pave_subgrade","lookup","pave_subgrade",null,null,null,"Mandatory",null,{"$f":"IF(pavement_key[[#This Row],[Factor]]=\"\",\"\",COLUMN(INDIRECT($A$120&$I133)))","v":""}]
["Thickness","thickness","number",null,null,null,null,"Mandatory",null,{"$f":"IF(pavement_key[[#This Row],[Factor]]=\"\",\"\",COLUMN(INDIRECT($A$120&$I134)))","v":""}]
["Pavement Material","pave_material","lookup","pave_material",null,null,null,"Mandatory",null,{"$f":"IF(pavement_key[[#This Row],[Factor]]=\"\",\"\",COLUMN(INDIRECT($A$120&$I135)))","v":""}]
["Pavement Source","pave_source","lookup","pave_source",null,null,null,"Mandatory",null,{"$f":"IF(pavement_key[[#This Row],[Factor]]=\"\",\"\",COLUMN(INDIRECT($A$120&$I136)))","v":""}]
["Recycling","recycling","boolean","t_f",null,"Y",false,"Mandatory",null,{"$f":"IF(pavement_key[[#This Row],[Factor]]=\"\",\"\",COLUMN(INDIRECT($A$120&$I137)))","v":""}]
["End User Specification","pave_spec","lookup","pave_spec",null,null,null,"Mandatory",null,{"$f":"IF(pavement_key[[#This Row],[Factor]]=\"\",\"\",COLUMN(INDIRECT($A$120&$I138)))","v":""}]
["Reconstructed?","reconstructed","lookup","reconstructed",null,"Y","U","Mandatory",null,{"$f":"IF(pavement_key[[#This Row],[Factor]]=\"\",\"\",COLUMN(INDIRECT($A$120&$I139)))","v":""}]
["Stabilising Agent Type","pave_st_agent","?",null,null,null,null,"Mandatory",null,{"$f":"IF(pavement_key[[#This Row],[Factor]]=\"\",\"\",COLUMN(INDIRECT($A$120&$I140)))","v":""}]
["Construction Plan No.","plan_no","number",null,null,null,null,"Mandatory",null,{"$f":"IF(pavement_key[[#This Row],[Factor]]=\"\",\"\",COLUMN(INDIRECT($A$120&$I141)))","v":""}]
["Design Life","design_life","number",null,null,null,null,"Mandatory",null,{"$f":"IF(pavement_key[[#This Row],[Factor]]=\"\",\"\",COLUMN(INDIRECT($A$120&$I142)))","v":""}]
["Design ESA","design_esa","number",null,null,null,null,"Mandatory",null,{"$f":"IF(pavement_key[[#This Row],[Factor]]=\"\",\"\",COLUMN(INDIRECT($A$120&$I143)))","v":""}]
["FWP code","fw_treatment","lookup","fw_treatment",null,null,null,"Mandatory",null,{"$f":"IF(pavement_key[[#This Row],[Factor]]=\"\",\"\",COLUMN(INDIRECT($A$120&$I144)))","v":""}]
["Owner","asset_owner","lookup","asset_owner",null,null,null,"Mandatory",null,{"$f":"IF(pavement_key[[#This Row],[Factor]]=\"\",\"\",COLUMN(INDIRECT($A$120&$I145)))","v":""}]
["Cost","original_cost","number",null,null,null,null,"Mandatory",null,{"$f":"IF(pavement_key[[#This Row],[Factor]]=\"\",\"\",COLUMN(INDIRECT($A$120&$I146)))","v":""}]
["Notes","notes","text",null,null,null,null,"Mandatory",null,{"$f":"IF(pavement_key[[#This Row],[Factor]]=\"\",\"\",COLUMN(INDIRECT($A$120&$I147)))","v":""}]
["SW_Channel",null,null,null,null,null,null,null,null,{"$f":"IF(pavement_key[[#This Row],[Factor]]=\"\",\"\",COLUMN(INDIRECT($A$120&$I148)))","v":""}]
["Column Name","RAMM field name","Data Type","Lookup Table","Column1","Required by Software","Generated Value","Required by NZTA","Factor","Factor Address","Condition","Column2","Field Description","Allowable Values","Data Collection Notes","Database Management Guidance Notes"]
["Road ID","road_id","number",null,null,"Y",null,"Mandatory",null,{"$f":"IF(sw_channel_key[[#This Row],[Factor]]=\"\",\"\",COLUMN(INDIRECT($A$148&$I150)))","v":""}]
["Start","start_m","number",null,null,"Y",null,"Mandatory",null,{"$f":"IF(sw_channel_key[[#This Row],[Factor]]=\"\",\"\",COLUMN(INDIRECT($A$148&$I151)))","v":""}]
["End","end_m","number",null,null,"Y",null,"Mandatory",null,{"$f":"IF(sw_channel_key[[#This Row],[Factor]]=\"\",\"\",COLUMN(INDIRECT($A$148&$I152)))","v":""}]
["Side","side","lookup","side",null,"Y",null,"Mandatory",null,{"$f":"IF(sw_channel_key[[#This Row],[Factor]]=\"\",\"\",COLUMN(INDIRECT($A$148&$I153)))","v":""}]
["Length","length_m","auto",null,null,"Y",null,"Mandatory",null,{"$f":"IF(sw_channel_key[[#This Row],[Factor]]=\"\",\"\",COLUMN(INDIRECT($A$148&$I154)))","v":""}]
["Adjusted Length","length_adjust_m","number",null,null,null,null,"Optional",null,{"$f":"IF(sw_channel_key[[#This Row],[Factor]]=\"\",\"\",COLUMN(INDIRECT($A$148&$I155)))","v":""}]
["Adjust Reason","len_adjust_rsn","lookup","len_adjust_rsn",null,null,null,"Conditional","[Adjusted Length]",{"$f":"IF(sw_channel_key[[#This Row],[Factor]]=\"\",\"\",COLUMN(INDIRECT($A$148&$I156)))","v":10},"<>\"\""]
["Offset","offset","number",null,null,null,null,"Mandatory",null,{"$f":"IF(sw_channel_key[[#This Row],[Factor]]=\"\",\"\",COLUMN(INDIRECT($A$148&$I157)))","v":""}]
["Surface Water Channel Type","swc_type","lookup","swc_type",null,null,null,"Mandatory",null,{"$f":"IF(sw_channel_key[[#This Row],[Factor]]=\"\",\"\",COLUMN(INDIRECT($A$148&$I158)))","v":""}]
["Construction Date","constructed","date",null,null,null,null,"Mandatory",null,{"$f":"IF(sw_channel_key[[#This Row],[Factor]]=\"\",\"\",COLUMN(INDIRECT($A$148&$I159)))","v":""}]
["Owner","asset_owner","lookup","asset_owner",null,null,null,"Mandatory",null,{"$f":"IF(sw_channel_key[[#This Row],[Factor]]=\"\",\"\",COLUMN(INDIRECT($A$148&$I160)))","v":""}]
["Cost","original_cost","number",null,null,null,null,"Mandatory",null,{"$f":"IF(sw_channel_key[[#This Row],[Factor]]=\"\",\"\",COLUMN(INDIRECT($A$148&$I161)))","v":""}]
["RUL","rul_reset","lookup","rul_reset",null,"Y","N","Optional",null,{"$f":"IF(sw_channel_key[[#This Row],[Factor]]=\"\",\"\",COLUMN(INDIRECT($A$148&$I162)))","v":""}]
["Condition","condition","lookup","condition",null,"Y","U","Optional",null,{"$f":"IF(sw_channel_key[[#This Row],[Factor]]=\"\",\"\",COLUMN(INDIRECT($A$148&$I163)))","v":""}]
["Risk Likelihood","risk_likelihood","lookup","likelihood",null,"Y","U","Mandatory",null,{"$f":"IF(sw_channel_key[[#This Row],[Factor]]=\"\",\"\",COLUMN(INDIRECT($A$148&$I164)))","v":""}]
["Risk Consequence","risk_consequence","lookup","consequence",null,"Y","U","Mandatory",null,{"$f":"IF(sw_channel_key[[#This Row],[Factor]]=\"\",\"\",COLUMN(INDIRECT($A$148&$I165)))","v":""}]
["Failure Risk","risk","lookup","risk",null,"Y","U","Optional",null,{"$f":"IF(sw_channel_key[[#This Row],[Factor]]=\"\",\"\",COLUMN(INDIRECT($A$148&$I166)))","v":""}]
["Default RC?","use_default_rc","boolean","d_u",null,"Y","D","Optional",null,{"$f":"IF(sw_channel_key[[#This Row],[Factor]]=\"\",\"\",COLUMN(INDIRECT($A$148&$I167)))","v":""}]
["Notes","general_note","text",null,null,null,null,"Optional",null,{"$f":"IF(sw_channel_key[[#This Row],[Factor]]=\"\",\"\",COLUMN(INDIRECT($A$148&$I168)))","v":""}]
["Drainage"]
["Column Name","RAMM field name","Data Type","Lookup Table","Column1","Required by Software","Generated Value","Required by NZTA","Factor","Factor Address","Condition","Column2","Field Description","Allowable Values","Data Collection Notes","Database Management Guidance Notes"]
["Road ID","road_id","number",null,null,"Y",null,"Mandatory",null,{"$f":"IF(drainage_key[[#This Row],[Factor]]=\"\",\"\",COLUMN(INDIRECT($A$169&$I171)))","v":""}]
["Drain Type","drain_type","lookup","drain_type",null,"Y",null,"Mandatory",null,{"$f":"IF(drainage_key[[#This Row],[Factor]]=\"\",\"\",COLUMN(INDIRECT($A$169&$I172)))","v":""}]
["Location","location","number",null,null,"Y",null,"Mandatory",null,{"$f":"IF(drainage_key[[#This Row],[Factor]]=\"\",\"\",COLUMN(INDIRECT($A$169&$I173)))","v":""}]
["Construction Date","construct_date",null,null,null,null,null,"Mandatory",null,{"$f":"IF(drainage_key[[#This Row],[Factor]]=\"\",\"\",COLUMN(INDIRECT($A$169&$I174)))","v":""}]
["Culvert Number","culv_number","number",null,null,null,null,"Optional",null,{"$f":"IF(drainage_key[[#This Row],[Factor]]=\"\",\"\",COLUMN(INDIRECT($A$169&$I175)))","v":""}]
["Offset","offset","number",null,null,null,null,"Mandatory",null,{"$f":"IF(drainage_key[[#This Row],[Factor]]=\"\",\"\",COLUMN(INDIRECT($A$169&$I176)))","v":""}]
["Side","offset_side","lookup","cul_side",null,null,null,"Mandatory",null,{"$f":"IF(drainage_key[[#This Row],[Factor]]=\"\",\"\",COLUMN(INDIRECT($A$169&$I177)))","v":""}]
["Length","drain_length","number",null,null,null,null,"Mandatory",null,{"$f":"IF(drainage_key[[#This Row],[Factor]]=\"\",\"\",COLUMN(INDIRECT($A$169&$I178)))","v":""}]
["Size","drain_size","number",null,null,null,null,"Mandatory",null,{"$f":"IF(drainage_key[[#This Row],[Factor]]=\"\",\"\",COLUMN(INDIRECT($A$169&$I179)))","v":""}]
["Material","drain_material","lookup","drain_material",null,null,null,"Mandatory",null,{"$f":"IF(drainage_key[[#This Row],[Factor]]=\"\",\"\",COLUMN(INDIRECT($A$169&$I180)))","v":""}]
["Inlet","inlet","lookup","drain_entry",null,null,null,"Mandatory",null,{"$f":"IF(drainage_key[[#This Row],[Factor]]=\"\",\"\",COLUMN(INDIRECT($A$169&$I181)))","v":""}]
["Outlet","outlet","lookup","drain_entry",null,null,null,"Mandatory",null,{"$f":"IF(drainage_key[[#This Row],[Factor]]=\"\",\"\",COLUMN(INDIRECT($A$169&$I182)))","v":""}]
["Culvert Type","drain_culvert","lookup","drain_culvert",null,null,null,"Mandatory",null,{"$f":"IF(drainage_key[[#This Row],[Factor]]=\"\",\"\",COLUMN(INDIRECT($A$169&$I183)))","v":""}]
["Width","cul_width","number",null,null,null,null,"Mandatory",null,{"$f":"IF(drainage_key[[#This Row],[Factor]]=\"\",\"\",COLUMN(INDIRECT($A$169&$I184)))","v":""}]
["Area","cul_area","auto",null,null,null,null,"Mandatory",null,{"$f":"IF(drainage_key[[#This Row],[Factor]]=\"\",\"\",COLUMN(INDIRECT($A$169&$I185)))","v":""}]
["Hazard","hazard","boolean","y_n",null,"Y","U","Optional",null,{"$f":"IF(drainage_key[[#This Row],[Factor]]=\"\",\"\",COLUMN(INDIRECT($A$169&$I186)))","v":""}]
["Waterway","wway","lookup","br_waterway",null,null,null,"Mandatory",null,{"$f":"IF(drainage_key[[#This Row],[Factor]]=\"\",\"\",COLUMN(INDIRECT($A$169&$I187)))","v":""}]
["Shape","drain_shape","lookup","drain_shape",null,null,null,"Mandatory",null,{"$f":"IF(drainage_key[[#This Row],[Factor]]=\"\",\"\",COLUMN(INDIRECT($A$169&$I188)))","v":""}]
["Fish Passage","fish_passage","boolean","t_f",null,"Y",false,"Mandatory",null,{"$f":"IF(drainage_key[[#This Row],[Factor]]=\"\",\"\",COLUMN(INDIRECT($A$169&$I189)))","v":""}]
["Flow Direction","flow_direction","lookup","flow_dir",null,"Y","N","Mandatory",null,{"$f":"IF(drainage_key[[#This Row],[Factor]]=\"\",\"\",COLUMN(INDIRECT($A$169&$I190)))","v":""}]
["Condition","condition","lookup","condition",null,"Y","U","Optional",null,{"$f":"IF(drainage_key[[#This Row],[Factor]]=\"\",\"\",COLUMN(INDIRECT($A$169&$I191)))","v":""}]
["Risk Likelihood","risk_likelihood","lookup","likelihood",null,"Y","U","Optional",null,{"$f":"IF(drainage_key[[#This Row],[Factor]]=\"\",\"\",COLUMN(INDIRECT($A$169&$I192)))","v":""}]
["Risk Consequence","risk_consequence","lookup","consequence",null,"Y","U","Optional",null,{"$f":"IF(drainage_key[[#This Row],[Factor]]=\"\",\"\",COLUMN(INDIRECT($A$169&$I193)))","v":""}]
["Failure Risk","risk","lookup","risk",null,"Y","U","Optional",null,{"$f":"IF(drainage_key[[#This Row],[Factor]]=\"\",\"\",COLUMN(INDIRECT($A$169&$I194)))","v":""}]
["Default RC?","use_default_rc","boolean","d_u",null,"Y","D","Optional",null,{"$f":"IF(drainage_key[[#This Row],[Factor]]=\"\",\"\",COLUMN(INDIRECT($A$169&$I195)))","v":""}]
["Owner","asset_owner","lookup","asset_owner",null,null,null,"Mandatory",null,{"$f":"IF(drainage_key[[#This Row],[Factor]]=\"\",\"\",COLUMN(INDIRECT($A$169&$I196)))","v":""}]
["Notes","general_note","text",null,null,null,null,"Mandatory",null,{"$f":"IF(drainage_key[[#This Row],[Factor]]=\"\",\"\",COLUMN(INDIRECT($A$169&$I197)))","v":""}]
["Railings",null,null,null,null,null,null,null,null,{"$f":"IF(drainage_key[[#This Row],[Factor]]=\"\",\"\",COLUMN(INDIRECT($A$169&$I198)))","v":""}]
["Column Name","RAMM field name","Data Type","Lookup Table","Column1","Required by Software","Generated Value","Required by NZTA","Factor","Factor Address","Condition","Column2","Field Description","Allowable Values","Data Collection Notes","Database Management Guidance Notes"]
["Road ID","road_id","number",null,null,"Y",null,"Mandatory",null,{"$f":"IF(railings_key[[#This Row],[Factor]]=\"\",\"\",COLUMN(INDIRECT($A$169&$I200)))","v":""}]
["Start","start_m","number",null,null,"Y",null,"Mandatory",null,{"$f":"IF(railings_key[[#This Row],[Factor]]=\"\",\"\",COLUMN(INDIRECT($A$169&$I201)))","v":""}]
["End","end_m","number",null,null,"Y",null,"Mandatory",null,{"$f":"IF(railings_key[[#This Row],[Factor]]=\"\",\"\",COLUMN(INDIRECT($A$169&$I202)))","v":""}]
["Length","length_m","auto",null,null,null,null,"Mandatory",null,{"$f":"IF(railings_key[[#This Row],[Factor]]=\"\",\"\",COLUMN(INDIRECT($A$169&$I203)))","v":""}]
["Offset","offset","number",null,null,null,null,"Mandatory",null,{"$f":"IF(railings_key[[#This Row],[Factor]]=\"\",\"\",COLUMN(INDIRECT($A$169&$I204)))","v":""}]
["Side","side","lookup","railing_side",null,null,null,"Mandatory",null,{"$f":"IF(railings_key[[#This Row],[Factor]]=\"\",\"\",COLUMN(INDIRECT($A$169&$I205)))","v":""}]
["Type","railing_type","lookup","railing_type",null,null,null,"Mandatory",null,{"$f":"IF(railings_key[[#This Row],[Factor]]=\"\",\"\",COLUMN(INDIRECT($A$169&$I206)))","v":""}]
["Install Date","install_date","date",null,null,null,null,"Mandatory",null,{"$f":"IF(railings_key[[#This Row],[Factor]]=\"\",\"\",COLUMN(INDIRECT($A$169&$I207)))","v":""}]
["Height","ground_height","number",null,null,null,null,"Mandatory",null,{"$f":"IF(railings_key[[#This Row],[Factor]]=\"\",\"\",COLUMN(INDIRECT($A$169&$I208)))","v":""}]
["Manufacturer","railing_make","lookup","railing_make",null,null,null,"Mandatory",null,{"$f":"IF(railings_key[[#This Row],[Factor]]=\"\",\"\",COLUMN(INDIRECT($A$169&$I209)))","v":""}]
["Shape","shape","lookup","railing_shape",null,null,null,"Mandatory",null,{"$f":"IF(railings_key[[#This Row],[Factor]]=\"\",\"\",COLUMN(INDIRECT($A$169&$I210)))","v":""}]
["Material","railing_material","lookup","railing_material",null,null,null,"Mandatory",null,{"$f":"IF(railings_key[[#This Row],[Factor]]=\"\",\"\",COLUMN(INDIRECT($A$169&$I211)))","v":""}]
["Attachments","railing_attach","lookup","railing_attach",null,null,null,"Mandatory",null,{"$f":"IF(railings_key[[#This Row],[Factor]]=\"\",\"\",COLUMN(INDIRECT($A$169&$I212)))","v":""}]
["Start Style","rail_start_style","lookup","rail_style",null,null,null,"Mandatory",null,{"$f":"IF(railings_key[[#This Row],[Factor]]=\"\",\"\",COLUMN(INDIRECT($A$169&$I213)))","v":""}]
["End Style","rail_end_style","lookup","rail_style",null,null,null,"Mandatory",null,{"$f":"IF(railings_key[[#This Row],[Factor]]=\"\",\"\",COLUMN(INDIRECT($A$169&$I214)))","v":""}]
["Ground Fix","railing_ground_fix","lookup","railing_ground_fix",null,"Y","U","Mandatory",null,{"$f":"IF(railings_key[[#This Row],[Factor]]=\"\",\"\",COLUMN(INDIRECT($A$169&$I215)))","v":""}]
["RUL reset","rul_reset","lookup","rul_reset",null,null,null,"Mandatory",null,{"$f":"IF(railings_key[[#This Row],[Factor]]=\"\",\"\",COLUMN(INDIRECT($A$169&$I216)))","v":""}]
["Condition","condition","lookup","condition",null,"Y","U","Optional",null,{"$f":"IF(railings_key[[#This Row],[Factor]]=\"\",\"\",COLUMN(INDIRECT($A$169&$I217)))","v":""}]
["Risk Likelihood","risk_likelihood","lookup","likelihood",null,"Y","U","Optional",null,{"$f":"IF(railings_key[[#This Row],[Factor]]=\"\",\"\",COLUMN(INDIRECT($A$169&$I218)))","v":""}]
["Risk Consequence","risk_consequence","lookup","consequence",null,"Y","U","Optional",null,{"$f":"IF(railings_key[[#This Row],[Factor]]=\"\",\"\",COLUMN(INDIRECT($A$169&$I219)))","v":""}]
["Failure Risk","risk","lookup","risk",null,"Y","U","Optional",null,{"$f":"IF(railings_key[[#This Row],[Factor]]=\"\",\"\",COLUMN(INDIRECT($A$169&$I220)))","v":""}]
["Post Condition","post_condition","lookup","condition",null,null,null,"Optional",null,{"$f":"IF(railings_key[[#This Row],[Factor]]=\"\",\"\",COLUMN(INDIRECT($A$169&$I221)))","v":""}]
["Paint System","paint_system","lookup","paint_system",null,null,null,"Optional",null,{"$f":"IF(railings_key[[#This Row],[Factor]]=\"\",\"\",COLUMN(INDIRECT($A$169&$I222)))","v":""}]
["Default RC?","use_default_rc","boolean","d_u",null,"Y","D","Optional",null,{"$f":"IF(railings_key[[#This Row],[Factor]]=\"\",\"\",COLUMN(INDIRECT($A$169&$I223)))","v":""}]
["Owner","asset_owner","lookup","asset_owner",null,null,null,"Mandatory",null,{"$f":"IF(railings_key[[#This Row],[Factor]]=\"\",\"\",COLUMN(INDIRECT($A$169&$I224)))","v":""}]
["Cost","original_cost","number",null,null,null,null,"Mandatory",null,{"$f":"IF(railings_key[[#This Row],[Factor]]=\"\",\"\",COLUMN(INDIRECT($A$169&$I225)))","v":""}]
["Notes","general_note","text",null,null,null,null,"Optional",null,{"$f":"IF(railings_key[[#This Row],[Factor]]=\"\",\"\",COLUMN(INDIRECT($A$169&$I226)))","v":""}]
["Bridges"]
["Column Name","RAMM field name","Data Type","Lookup Table","Column1","Required by Software","Generated Value","Required by NZTA","Factor","Factor Address","Condition","Column2","Field Description","Allowable Values","Data Collection Notes","Database Management Guidance Notes"]
["Road ID","road_id","number",null,null,"Y",null,"Mandatory",null,{"$f":"IF(bridges_key[[#This Row],[Factor]]=\"\",\"\",COLUMN(INDIRECT($A$169&$I229)))","v":""}]
["Bridge Number","bridge_no","number",null,null,"Y",null,"Mandatory",null,{"$f":"IF(bridges_key[[#This Row],[Factor]]=\"\",\"\",COLUMN(INDIRECT($A$169&$I230)))","v":""}]
["Bridge Name","bridge_name","text",null,null,"Y",null,"Mandatory",null,{"$f":"IF(bridges_key[[#This Row],[Factor]]=\"\",\"\",COLUMN(INDIRECT($A$169&$I231)))","v":""}]
["Owner","asset_owner","lookup","asset_owner",null,null,null,"Mandatory",null,{"$f":"IF(bridges_key[[#This Row],[Factor]]=\"\",\"\",COLUMN(INDIRECT($A$169&$I232)))","v":""}]
["Culvert","culvert_sw","boolean","y_n",null,"Y",null,"Mandatory",null,{"$f":"IF(bridges_key[[#This Row],[Factor]]=\"\",\"\",COLUMN(INDIRECT($A$169&$I233)))","v":""}]
["Urban or Rural","urban_rural","lookup","urban_rural",null,"Y",null,"Mandatory",null,{"$f":"IF(bridges_key[[#This Row],[Factor]]=\"\",\"\",COLUMN(INDIRECT($A$169&$I234)))","v":""}]
["Start","start_m","number",null,null,"Y",null,"Mandatory",null,{"$f":"IF(bridges_key[[#This Row],[Factor]]=\"\",\"\",COLUMN(INDIRECT($A$169&$I235)))","v":""}]
["End","end_m","number",null,null,"Y",null,"Mandatory",null,{"$f":"IF(bridges_key[[#This Row],[Factor]]=\"\",\"\",COLUMN(INDIRECT($A$169&$I236)))","v":""}]
["Length","length_m","auto",null,null,"Y",null,"Mandatory",null,{"$f":"IF(bridges_key[[#This Row],[Factor]]=\"\",\"\",COLUMN(INDIRECT($A$169&$I237)))","v":""}]
["Rail to Rail","rail_to_rail","number",null,null,null,null,"Optional",null,{"$f":"IF(bridges_key[[#This Row],[Factor]]=\"\",\"\",COLUMN(INDIRECT($A$169&$I238)))","v":""}]
["Kerb to Kerb","kerb_to_kerb","number",null,null,null,null,"Optional",null,{"$f":"IF(bridges_key[[#This Row],[Factor]]=\"\",\"\",COLUMN(INDIRECT($A$169&$I239)))","v":""}]
["Constructed Date","constructed","date",null,null,null,null,"Mandatory",null,{"$f":"IF(bridges_key[[#This Row],[Factor]]=\"\",\"\",COLUMN(INDIRECT($A$169&$I240)))","v":""}]
["Lanes","lanes","number",null,null,"Y",null,"Mandatory",null,{"$f":"IF(bridges_key[[#This Row],[Factor]]=\"\",\"\",COLUMN(INDIRECT($A$169&$I241)))","v":""}]
["Traffic Direction","traffic_direction","lookup","traffic_direction",null,"Y",null,"Mandatory",null,{"$f":"IF(bridges_key[[#This Row],[Factor]]=\"\",\"\",COLUMN(INDIRECT($A$169&$I242)))","v":""}]
["Bridge Type","bridge_type","lookup","bridge_type",null,null,null,"Mandatory",null,{"$f":"IF(bridges_key[[#This Row],[Factor]]=\"\",\"\",COLUMN(INDIRECT($A$169&$I243)))","v":""}]
["SH Bridge Function","sh_func_type","lookup","br_sh_func_type",null,null,null,"Mandatory",null,{"$f":"IF(bridges_key[[#This Row],[Factor]]=\"\",\"\",COLUMN(INDIRECT($A$169&$I244)))","v":""}]
["Combined Function","comb_func_type","lookup","br_comb_func_type",null,null,null,"Mandatory",null,{"$f":"IF(bridges_key[[#This Row],[Factor]]=\"\",\"\",COLUMN(INDIRECT($A$169&$I245)))","v":""}]
["Start Slab Present","start_settle_slab","lookup","start_settle_slab",null,"Y",null,"Mandatory",null,{"$f":"IF(bridges_key[[#This Row],[Factor]]=\"\",\"\",COLUMN(INDIRECT($A$169&$I246)))","v":""}]
["End Slab Present","end_settle_slab","lookup","end_settle_slab",null,"Y",null,"Mandatory",null,{"$f":"IF(bridges_key[[#This Row],[Factor]]=\"\",\"\",COLUMN(INDIRECT($A$169&$I247)))","v":""}]
["Curvature Type","curvature_type","lookup","br_curvature_type",null,null,null,"Mandatory",null,{"$f":"IF(bridges_key[[#This Row],[Factor]]=\"\",\"\",COLUMN(INDIRECT($A$169&$I248)))","v":""}]
["RUL reset","rul_reset","lookup","rul_reset",null,null,null,"Mandatory",null,{"$f":"IF(bridges_key[[#This Row],[Factor]]=\"\",\"\",COLUMN(INDIRECT($A$169&$I249)))","v":""}]
["Condition","condition","lookup","condition",null,"Y","U","Optional",null,{"$f":"IF(bridges_key[[#This Row],[Factor]]=\"\",\"\",COLUMN(INDIRECT($A$169&$I250)))","v":""}]
["Risk Likelihood","risk_likelihood","lookup","likelihood",null,"Y","U","Optional",null,{"$f":"IF(bridges_key[[#This Row],[Factor]]=\"\",\"\",COLUMN(INDIRECT($A$169&$I251)))","v":""}]
["Risk Consequence","risk_consequence","lookup","consequence",null,"Y","U","Optional",null,{"$f":"IF(bridges_key[[#This Row],[Factor]]=\"\",\"\",COLUMN(INDIRECT($A$169&$I252)))","v":""}]
["Failure Risk","risk","lookup","risk",null,"Y","U","Optional",null,{"$f":"IF(bridges_key[[#This Row],[Factor]]=\"\",\"\",COLUMN(INDIRECT($A$169&$I253)))","v":""}]
["Notes","notes","text",null,null,null,null,"Optional",null,{"$f":"IF(bridges_key[[#This Row],[Factor]]=\"\",\"\",COLUMN(INDIRECT($A$169&$I254)))","v":""}]
["Features"]
["Column Name","RAMM field name","Data Type","Lookup Table","Column1","Required by Software","Generated Value","Required by NZTA","Factor","Factor Address","Condition","Column2","Field Description","Allowable Values","Data Collection Notes","Database Management Guidance Notes"]
["Road ID","road_id","number",null,null,"Y",null,"Mandatory",null,{"$f":"IF(features_key[[#This Row],[Factor]]=\"\",\"\",COLUMN(INDIRECT($A$169&$I257)))","v":""}]
["Location","location","number",null,null,"Y",null,"Mandatory",null,{"$f":"IF(features_key[[#This Row],[Factor]]=\"\",\"\",COLUMN(INDIRECT($A$169&$I258)))","v":""}]
["Side","side","lookup","side",null,"Y",null,"Mandatory",null,{"$f":"IF(features_key[[#This Row],[Factor]]=\"\",\"\",COLUMN(INDIRECT($A$169&$I259)))","v":""}]
["Offset","offset","number",null,null,null,null,"Mandatory",null,{"$f":"IF(features_key[[#This Row],[Factor]]=\"\",\"\",COLUMN(INDIRECT($A$169&$I260)))","v":""}]
["Feature Type","feature_type","lookup","feature_type",null,null,null,"Mandatory",null,{"$f":"IF(features_key[[#This Row],[Factor]]=\"\",\"\",COLUMN(INDIRECT($A$169&$I261)))","v":""}]
["Constructed Date","constructed","date",null,null,null,null,"Mandatory",null,{"$f":"IF(features_key[[#This Row],[Factor]]=\"\",\"\",COLUMN(INDIRECT($A$169&$I262)))","v":""}]
["RUL reset","rul_reset","lookup","rul_reset",null,null,null,"Mandatory",null,{"$f":"IF(features_key[[#This Row],[Factor]]=\"\",\"\",COLUMN(INDIRECT($A$169&$I263)))","v":""}]
["Condition","condition","lookup","condition",null,"Y","U","Optional",null,{"$f":"IF(features_key[[#This Row],[Factor]]=\"\",\"\",COLUMN(INDIRECT($A$169&$I264)))","v":""}]
["Risk Likelihood","risk_likelihood","lookup","likelihood",null,"Y","U","Optional",null,{"$f":"IF(features_key[[#This Row],[Factor]]=\"\",\"\",COLUMN(INDIRECT($A$169&$I265)))","v":""}]
["Risk Consequence","risk_consequence","lookup","consequence",null,"Y","U","Optional",null,{"$f":"IF(features_key[[#This Row],[Factor]]=\"\",\"\",COLUMN(INDIRECT($A$169&$I266)))","v":""}]
["Failure Risk","risk","lookup","risk",null,"Y","U","Optional",null,{"$f":"IF(features_key[[#This Row],[Factor]]=\"\",\"\",COLUMN(INDIRECT($A$169&$I267)))","v":""}]
["Owner","asset_owner","lookup","asset_owner",null,null,null,"Mandatory",null,{"$f":"IF(features_key[[#This Row],[Factor]]=\"\",\"\",COLUMN(INDIRECT($A$169&$I268)))","v":""}]
["Cost","original_cost","number",null,null,null,null,"Mandatory",null,{"$f":"IF(features_key[[#This Row],[Factor]]=\"\",\"\",COLUMN(INDIRECT($A$169&$I269)))","v":""}]
["Notes","notes","text",null,null,null,null,"Optional",null,{"$f":"IF(features_key[[#This Row],[Factor]]=\"\",\"\",COLUMN(INDIRECT($A$169&$I270)))","v":""}]
["Footpaths"]
["Column Name","RAMM field name","Data Type","Lookup Table","Column1","Required by Software","Generated Value","Required by NZTA","Factor","Factor Address","Condition","Column2","Field Description","Allowable Values","Data Collection Notes","Database Management Guidance Notes"]
["Road ID","road_id","number",null,null,"Y",null,"Mandatory",null,{"$f":"IF(footpaths_key[[#This Row],[Factor]]=\"\",\"\",COLUMN(INDIRECT($A$169&$I273)))","v":""}]
["Owner","asset_owner","lookup","asset_owner",null,null,null,"Mandatory",null,{"$f":"IF(footpaths_key[[#This Row],[Factor]]=\"\",\"\",COLUMN(INDIRECT($A$169&$I274)))","v":""}]
["Start","start","number",null,null,null,null,"Mandatory",null,{"$f":"IF(footpaths_key[[#This Row],[Factor]]=\"\",\"\",COLUMN(INDIRECT($A$169&$I275)))","v":""}]
["Start Description","start_desc","text",null,null,null,null,"Optional",null,{"$f":"IF(footpaths_key[[#This Row],[Factor]]=\"\",\"\",COLUMN(INDIRECT($A$169&$I276)))","v":""}]
["End","end","number",null,null,null,null,"Mandatory",null,{"$f":"IF(footpaths_key[[#This Row],[Factor]]=\"\",\"\",COLUMN(INDIRECT($A$169&$I277)))","v":""}]
["End Description","end_desc","text",null,null,null,null,"Optional",null,{"$f":"IF(footpaths_key[[#This Row],[Factor]]=\"\",\"\",COLUMN(INDIRECT($A$169&$I278)))","v":""}]
["Side","side","lookup","side",null,null,null,"Mandatory",null,{"$f":"IF(footpaths_key[[#This Row],[Factor]]=\"\",\"\",COLUMN(INDIRECT($A$169&$I279)))","v":""}]
["Offset (Kerb)","offset_kerb","number",null,null,null,null,"Optional",null,{"$f":"IF(footpaths_key[[#This Row],[Factor]]=\"\",\"\",COLUMN(INDIRECT($A$169&$I280)))","v":""}]
["Position","footpath_position","lookup","footpath_position",null,null,null,"Mandatory",null,{"$f":"IF(footpaths_key[[#This Row],[Factor]]=\"\",\"\",COLUMN(INDIRECT($A$169&$I281)))","v":""}]
["Length","length_m","auto",null,null,null,null,"Mandatory",null,{"$f":"IF(footpaths_key[[#This Row],[Factor]]=\"\",\"\",COLUMN(INDIRECT($A$169&$I282)))","v":""}]
["Width","width","number",null,null,null,null,"Mandatory",null,{"$f":"IF(footpaths_key[[#This Row],[Factor]]=\"\",\"\",COLUMN(INDIRECT($A$169&$I283)))","v":""}]
["Footpath Material","footpath_surf_mat","lookup","footpath_surf_mat",null,null,null,"Mandatory",null,{"$f":"IF(footpaths_key[[#This Row],[Factor]]=\"\",\"\",COLUMN(INDIRECT($A$169&$I284)))","v":""}]
["Depth","overlay_depth","number",null,null,null,null,"Mandatory",null,{"$f":"IF(footpaths_key[[#This Row],[Factor]]=\"\",\"\",COLUMN(INDIRECT($A$169&$I285)))","v":""}]
["Chip Size","chip_size","number",null,null,null,null,"Mandatory",null,{"$f":"IF(footpaths_key[[#This Row],[Factor]]=\"\",\"\",COLUMN(INDIRECT($A$169&$I286)))","v":""}]
["Binder","surf_binder","lookup","surf_binder",null,null,null,"Mandatory",null,{"$f":"IF(footpaths_key[[#This Row],[Factor]]=\"\",\"\",COLUMN(INDIRECT($A$169&$I287)))","v":""}]
["Pedestrian Density","pedestrian_use","lookup","footpath_use",null,null,null,"Optional",null,{"$f":"IF(footpaths_key[[#This Row],[Factor]]=\"\",\"\",COLUMN(INDIRECT($A$169&$I288)))","v":""}]
["Scooter Density","scooter_use","lookup","footpath_use",null,null,null,"Optional",null,{"$f":"IF(footpaths_key[[#This Row],[Factor]]=\"\",\"\",COLUMN(INDIRECT($A$169&$I289)))","v":""}]
["Bicycle Density","bicycle_use","lookup","footpath_use",null,null,null,"Optional",null,{"$f":"IF(footpaths_key[[#This Row],[Factor]]=\"\",\"\",COLUMN(INDIRECT($A$169&$I290)))","v":""}]
["Constructed Date","constructed","date",null,null,null,null,"Mandatory",null,{"$f":"IF(footpaths_key[[#This Row],[Factor]]=\"\",\"\",COLUMN(INDIRECT($A$169&$I291)))","v":""}]
["Surface Date","surface_date","date",null,null,null,null,"Mandatory",null,{"$f":"IF(footpaths_key[[#This Row],[Factor]]=\"\",\"\",COLUMN(INDIRECT($A$169&$I292)))","v":""}]
["Purpose","purpose","lookup","purpose",null,null,null,"Optional",null,{"$f":"IF(footpaths_key[[#This Row],[Factor]]=\"\",\"\",COLUMN(INDIRECT($A$169&$I293)))","v":""}]
["Cost","original_cost","number",null,null,null,null,"Optional",null,{"$f":"IF(footpaths_key[[#This Row],[Factor]]=\"\",\"\",COLUMN(INDIRECT($A$169&$I294)))","v":""}]
["RUL reset","rul_reset","lookup","rul_reset",null,null,null,"Mandatory",null,{"$f":"IF(footpaths_key[[#This Row],[Factor]]=\"\",\"\",COLUMN(INDIRECT($A$169&$I295)))","v":""}]
["Condition","condition","lookup","condition",null,"Y","U","Optional",null,{"$f":"IF(footpaths_key[[#This Row],[Factor]]=\"\",\"\",COLUMN(INDIRECT($A$169&$I296)))","v":""}]
["Risk Likelihood","risk_likelihood","lookup","likelihood",null,"Y","U","Optional",null,{"$f":"IF(footpaths_key[[#This Row],[Factor]]=\"\",\"\",COLUMN(INDIRECT($A$169&$I297)))","v":""}]
["Risk Consequence","risk_consequence","lookup","consequence",null,"Y","U","Optional",null,{"$f":"IF(footpaths_key[[#This Row],[Factor]]=\"\",\"\",COLUMN(INDIRECT($A$169&$I298)))","v":""}]
["Failure Risk","risk","lookup","risk",null,"Y","U","Optional",null,{"$f":"IF(footpaths_key[[#This Row],[Factor]]=\"\",\"\",COLUMN(INDIRECT($A$169&$I299)))","v":""}]
["Notes","notes","text",null,null,null,null,"Optional",null,{"$f":"IF(footpaths_key[[#This Row],[Factor]]=\"\",\"\",COLUMN(INDIRECT($A$169&$I300)))","v":""}]
["Islands",null,null,null,null,null,null,null,null,{"$f":"IF(footpaths_key[[#This Row],[Factor]]=\"\",\"\",COLUMN(INDIRECT($A$169&$I301)))","v":""}]
["Column Name","RAMM field name","Data Type","Lookup Table","Column1","Required by Software","Generated Value","Required by NZTA","Factor","Factor Address","Condition","Column2","Field Description","Allowable Values","Data Collection Notes","Database Management Guidance Notes"]
["Road ID","road_id","number",null,null,"Y",null,"Mandatory",null,{"$f":"IF(islands_key[[#This Row],[Factor]]=\"\",\"\",COLUMN(INDIRECT($A$169&$I303)))","v":""}]
["Northing","northing","number",null,null,null,null,"Optional",null,{"$f":"IF(islands_key[[#This Row],[Factor]]=\"\",\"\",COLUMN(INDIRECT($A$169&$I304)))","v":""}]
["Easting","easting","number",null,null,null,null,"Optional",null,{"$f":"IF(islands_key[[#This Row],[Factor]]=\"\",\"\",COLUMN(INDIRECT($A$169&$I305)))","v":""}]
["Type","island_type","lookup","island_type",null,"Y",null,"Mandatory",null,{"$f":"IF(islands_key[[#This Row],[Factor]]=\"\",\"\",COLUMN(INDIRECT($A$169&$I306)))","v":""}]
["Constructed Date","constructed","date",null,null,null,null,"Mandatory",null,{"$f":"IF(islands_key[[#This Row],[Factor]]=\"\",\"\",COLUMN(INDIRECT($A$169&$I307)))","v":""}]
["Shape","island_shape","lookup","island_shape",null,null,null,"Mandatory",null,{"$f":"IF(islands_key[[#This Row],[Factor]]=\"\",\"\",COLUMN(INDIRECT($A$169&$I308)))","v":""}]
["Material","island_mat","lookup","island_mat",null,null,null,"Mandatory",null,{"$f":"IF(islands_key[[#This Row],[Factor]]=\"\",\"\",COLUMN(INDIRECT($A$169&$I309)))","v":""}]
["Height","height","number",null,null,null,null,"Optional",null,{"$f":"IF(islands_key[[#This Row],[Factor]]=\"\",\"\",COLUMN(INDIRECT($A$169&$I310)))","v":""}]
["Width","width","number",null,null,null,null,"Optional",null,{"$f":"IF(islands_key[[#This Row],[Factor]]=\"\",\"\",COLUMN(INDIRECT($A$169&$I311)))","v":""}]
["Maintenance Required","maintenance_reqd","boolean","y_n",null,"Y",null,"Mandatory",null,{"$f":"IF(islands_key[[#This Row],[Factor]]=\"\",\"\",COLUMN(INDIRECT($A$169&$I312)))","v":""}]
["Owner","asset_owner","lookup","asset_owner",null,null,null,"Mandatory",null,{"$f":"IF(islands_key[[#This Row],[Factor]]=\"\",\"\",COLUMN(INDIRECT($A$169&$I313)))","v":""}]
["Original Cost","original_cost","number",null,null,null,null,"Optional",null,{"$f":"IF(islands_key[[#This Row],[Factor]]=\"\",\"\",COLUMN(INDIRECT($A$169&$I314)))","v":""}]
["RUL reset","rul_reset","lookup","rul_reset",null,null,null,"Mandatory",null,{"$f":"IF(islands_key[[#This Row],[Factor]]=\"\",\"\",COLUMN(INDIRECT($A$169&$I315)))","v":""}]
["Condition","condition","lookup","condition",null,"Y","U","Optional",null,{"$f":"IF(islands_key[[#This Row],[Factor]]=\"\",\"\",COLUMN(INDIRECT($A$169&$I316)))","v":""}]
["Risk Likelihood","risk_likelihood","lookup","likelihood",null,"Y","U","Optional",null,{"$f":"IF(islands_key[[#This Row],[Factor]]=\"\",\"\",COLUMN(INDIRECT($A$169&$I317)))","v":""}]
["Risk Consequence","risk_consequence","lookup","consequence",null,"Y","U","Optional",null,{"$f":"IF(islands_key[[#This Row],[Factor]]=\"\",\"\",COLUMN(INDIRECT($A$169&$I318)))","v":""}]
["Failure Risk","risk","lookup","risk",null,"Y","U","Optional",null,{"$f":"IF(islands_key[[#This Row],[Factor]]=\"\",\"\",COLUMN(INDIRECT($A$169&$I319)))","v":""}]
["Notes","notes","text",null,null,null,null,"Optional",null,{"$f":"IF(islands_key[[#This Row],[Factor]]=\"\",\"\",COLUMN(INDIRECT($A$169&$I320)))","v":""}]
["ITS"]
["Column Name","RAMM field name","Data Type","Lookup Table","Column1","Required by Software","Generated Value","Required by NZTA","Factor","Factor Address","Condition","Column2","Field Description","Allowable Values","Data Collection Notes","Database Management Guidance Notes"]
["Road ID","road_id","number",null,null,"Y",null,"Mandatory",null,{"$f":"IF(its_key[[#This Row],[Factor]]=\"\",\"\",COLUMN(INDIRECT($A$169&$I323)))","v":""}]
["Location","location","number",null,null,null,null,"Mandatory",null,{"$f":"IF(its_key[[#This Row],[Factor]]=\"\",\"\",COLUMN(INDIRECT($A$169&$I324)))","v":""}]
["Site","site","text",null,null,"Y",null,"Optional",null,{"$f":"IF(its_key[[#This Row],[Factor]]=\"\",\"\",COLUMN(INDIRECT($A$169&$I325)))","v":""}]
["Location General","location_general","text",null,null,null,null,"Optional",null,{"$f":"IF(its_key[[#This Row],[Factor]]=\"\",\"\",COLUMN(INDIRECT($A$169&$I326)))","v":""}]
["NMA","nma","lookup","nma",null,"Y",10,"Optional",null,{"$f":"IF(its_key[[#This Row],[Factor]]=\"\",\"\",COLUMN(INDIRECT($A$169&$I327)))","v":""},null,null,"What NMA is the asset in?"]
["Easting","easting","number",null,null,null,null,"Optional",null,{"$f":"IF(its_key[[#This Row],[Factor]]=\"\",\"\",COLUMN(INDIRECT($A$169&$I328)))","v":""}]
["Northing","northing","number",null,null,null,null,"Optional",null,{"$f":"IF(its_key[[#This Row],[Factor]]=\"\",\"\",COLUMN(INDIRECT($A$169&$I329)))","v":""}]
["GPS Date","gps_date","date",null,null,null,null,"Optional",null,{"$f":"IF(its_key[[#This Row],[Factor]]=\"\",\"\",COLUMN(INDIRECT($A$169&$I330)))","v":""}]
["GPS Organisation","gps_by","lookup","organisation",null,null,null,"Optional",null,{"$f":"IF(its_key[[#This Row],[Factor]]=\"\",\"\",COLUMN(INDIRECT($A$169&$I331)))","v":""}]
["GPS Method","gps_method_id","lookup","gps_method",null,null,null,"Optional",null,{"$f":"IF(its_key[[#This Row],[Factor]]=\"\",\"\",COLUMN(INDIRECT($A$169&$I332)))","v":""}]
["Road Region","transit_region","text",null,null,"Y",4,"Optional",null,{"$f":"IF(its_key[[#This Row],[Factor]]=\"\",\"\",COLUMN(INDIRECT($A$169&$I333)))","v":""}]
["Street Address","street_address","text",null,null,null,null,"Optional",null,{"$f":"IF(its_key[[#This Row],[Factor]]=\"\",\"\",COLUMN(INDIRECT($A$169&$I334)))","v":""}]
["Offset","offset","number",null,null,null,null,"Mandatory",null,{"$f":"IF(its_key[[#This Row],[Factor]]=\"\",\"\",COLUMN(INDIRECT($A$169&$I335)))","v":""}]
["Side","side","lookup","side",null,null,null,"Mandatory",null,{"$f":"IF(its_key[[#This Row],[Factor]]=\"\",\"\",COLUMN(INDIRECT($A$169&$I336)))","v":""}]
["Field Name","field_name","text",null,null,null,null,"Optional",null,{"$f":"IF(its_key[[#This Row],[Factor]]=\"\",\"\",COLUMN(INDIRECT($A$169&$I337)))","v":""}]
["State","its_state","lookup","site_its_state",null,"Y",null,"Mandatory",null,{"$f":"IF(its_key[[#This Row],[Factor]]=\"\",\"\",COLUMN(INDIRECT($A$169&$I338)))","v":""}]
["State Date","its_state_date","date",null,null,"Y",null,"Mandatory",null,{"$f":"IF(its_key[[#This Row],[Factor]]=\"\",\"\",COLUMN(INDIRECT($A$169&$I339)))","v":""}]
["Type","its_type","lookup","its_type",null,"Y",null,"Mandatory",null,{"$f":"IF(its_key[[#This Row],[Factor]]=\"\",\"\",COLUMN(INDIRECT($A$169&$I340)))","v":""}]
["Subtype","its_subtype","lookup","its_subtype",null,"Y",null,"Mandatory",null,{"$f":"IF(its_key[[#This Row],[Factor]]=\"\",\"\",COLUMN(INDIRECT($A$169&$I341)))","v":""}]
["ITS Make","its_make","lookup","its_make",null,"Y",null,"Mandatory",null,{"$f":"IF(its_key[[#This Row],[Factor]]=\"\",\"\",COLUMN(INDIRECT($A$169&$I342)))","v":""}]
["ITS Model","its_model","lookup","its_model",null,null,null,"Optional",null,{"$f":"IF(its_key[[#This Row],[Factor]]=\"\",\"\",COLUMN(INDIRECT($A$169&$I343)))","v":""}]
["Asset Description","asset_description","text",null,null,null,null,"Optional",null,{"$f":"IF(its_key[[#This Row],[Factor]]=\"\",\"\",COLUMN(INDIRECT($A$169&$I344)))","v":""}]
["Serial Number","serial_no","text",null,null,null,null,"Optional",null,{"$f":"IF(its_key[[#This Row],[Factor]]=\"\",\"\",COLUMN(INDIRECT($A$169&$I345)))","v":""}]
["Supplier","supplier","lookup","site_supplier",null,"Y",null,"Mandatory",null,{"$f":"IF(its_key[[#This Row],[Factor]]=\"\",\"\",COLUMN(INDIRECT($A$169&$I346)))","v":""}]
["Support","support_type","lookup","site_support_type",null,null,null,"Optional",null,{"$f":"IF(its_key[[#This Row],[Factor]]=\"\",\"\",COLUMN(INDIRECT($A$169&$I347)))","v":""}]
["Owner","owner","lookup","site_owner",null,"Y",null,"Mandatory",null,{"$f":"IF(its_key[[#This Row],[Factor]]=\"\",\"\",COLUMN(INDIRECT($A$169&$I348)))","v":""}]
["Control System","control_system","lookup","site_control_system",null,null,null,"Optional",null,{"$f":"IF(its_key[[#This Row],[Factor]]=\"\",\"\",COLUMN(INDIRECT($A$169&$I349)))","v":""}]
["Communications","comms","lookup","site_comms",null,null,null,"Optional",null,{"$f":"IF(its_key[[#This Row],[Factor]]=\"\",\"\",COLUMN(INDIRECT($A$169&$I350)))","v":""}]
["Matintenance Contract","mtce_contract_no","text",null,null,null,null,"Optional",null,{"$f":"IF(its_key[[#This Row],[Factor]]=\"\",\"\",COLUMN(INDIRECT($A$169&$I351)))","v":""}]
["Maintained By","maintained_by","text",null,null,"Y",null,"Mandatory",null,{"$f":"IF(its_key[[#This Row],[Factor]]=\"\",\"\",COLUMN(INDIRECT($A$169&$I352)))","v":""}]
["Expected Replacement Year","expected_replace","date",null,null,null,null,"Optional",null,{"$f":"IF(its_key[[#This Row],[Factor]]=\"\",\"\",COLUMN(INDIRECT($A$169&$I353)))","v":""}]
["Construction Contract Number","construct_contract_no","text",null,null,null,null,"Optional",null,{"$f":"IF(its_key[[#This Row],[Factor]]=\"\",\"\",COLUMN(INDIRECT($A$169&$I354)))","v":""}]
["Contract Managed By","contract_mgd_by","lookup","site_contract_mgd_by",null,"Y",null,"Mandatory",null,{"$f":"IF(its_key[[#This Row],[Factor]]=\"\",\"\",COLUMN(INDIRECT($A$169&$I355)))","v":""}]
["IP Address","ip_address","text",null,null,null,null,"Optional",null,{"$f":"IF(its_key[[#This Row],[Factor]]=\"\",\"\",COLUMN(INDIRECT($A$169&$I356)))","v":""}]
["Installation Date","installation_date","date",null,null,"Y",null,"Mandatory",null,{"$f":"IF(its_key[[#This Row],[Factor]]=\"\",\"\",COLUMN(INDIRECT($A$169&$I357)))","v":""}]
["Design Life","design_life","number",null,null,"Y",null,"Mandatory",null,{"$f":"IF(its_key[[#This Row],[Factor]]=\"\",\"\",COLUMN(INDIRECT($A$169&$I358)))","v":""}]
["Condition Rating","condition_rating","text",null,null,null,null,"Optional",null,{"$f":"IF(its_key[[#This Row],[Factor]]=\"\",\"\",COLUMN(INDIRECT($A$169&$I359)))","v":""}]
["Condition Rating Date","condition_rat_date","date",null,null,null,null,"Optional",null,{"$f":"IF(its_key[[#This Row],[Factor]]=\"\",\"\",COLUMN(INDIRECT($A$169&$I360)))","v":""}]
["Purchase Cost","purchase_cost","number",null,null,"Y",null,"Mandatory",null,{"$f":"IF(its_key[[#This Row],[Factor]]=\"\",\"\",COLUMN(INDIRECT($A$169&$I361)))","v":""}]
["Defects Start Date","dlp_start_date","date",null,null,null,null,"Optional",null,{"$f":"IF(its_key[[#This Row],[Factor]]=\"\",\"\",COLUMN(INDIRECT($A$169&$I362)))","v":""}]
["End of Defects Liability Period","dlp_end_date","date",null,null,null,null,"Optional",null,{"$f":"IF(its_key[[#This Row],[Factor]]=\"\",\"\",COLUMN(INDIRECT($A$169&$I363)))","v":""}]
["Criticality","criticality","text",null,null,null,null,"Optional",null,{"$f":"IF(its_key[[#This Row],[Factor]]=\"\",\"\",COLUMN(INDIRECT($A$169&$I364)))","v":""}]
["RUL reset","rul_reset","lookup","rul_reset",null,null,null,"Optional",null,{"$f":"IF(its_key[[#This Row],[Factor]]=\"\",\"\",COLUMN(INDIRECT($A$169&$I365)))","v":""}]
["Condition","condition","lookup","condition",null,"Y","U","Optional",null,{"$f":"IF(its_key[[#This Row],[Factor]]=\"\",\"\",COLUMN(INDIRECT($A$169&$I366)))","v":""}]
["Risk Likelihood","risk_likelihood","lookup","likelihood",null,"Y","U","Optional",null,{"$f":"IF(its_key[[#This Row],[Factor]]=\"\",\"\",COLUMN(INDIRECT($A$169&$I367)))","v":""}]
["Risk Consequence","risk_consequence","lookup","consequence",null,"Y","U","Optional",null,{"$f":"IF(its_key[[#This Row],[Factor]]=\"\",\"\",COLUMN(INDIRECT($A$169&$I368)))","v":""}]
["Failure Risk","risk","lookup","risk",null,"Y","U","Optional",null,{"$f":"IF(its_key[[#This Row],[Factor]]=\"\",\"\",COLUMN(INDIRECT($A$169&$I369)))","v":""}]
["Notes","notes","text",null,null,null,null,"Optional",null,{"$f":"IF(its_key[[#This Row],[Factor]]=\"\",\"\",COLUMN(INDIRECT($A$169&$I370)))","v":""}]
["Minor Structures"]
["Column Name","RAMM field name","Data Type","Lookup Table","Column1","Required by Software","Generated Value","Required by NZTA","Factor","Factor Address","Condition","Column2","Field Description","Allowable Values","Data Collection Notes","Database Management Guidance Notes"]
["Road ID","road_id","number",null,null,"Y",null,"Mandatory",null,{"$f":"IF(minor_structures_key[[#This Row],[Factor]]=\"\",\"\",COLUMN(INDIRECT($A$169&$I373)))","v":""}]
["Start","start_m","number",null,null,null,null,null,null,{"$f":"IF(minor_structures_key[[#This Row],[Factor]]=\"\",\"\",COLUMN(INDIRECT($A$169&$I374)))","v":""}]
["Start Description","start_desc","text",null,null,null,null,null,null,{"$f":"IF(minor_structures_key[[#This Row],[Factor]]=\"\",\"\",COLUMN(INDIRECT($A$169&$I375)))","v":""}]
["End","end_m","number",null,null,null,null,null,null,{"$f":"IF(minor_structures_key[[#This Row],[Factor]]=\"\",\"\",COLUMN(INDIRECT($A$169&$I376)))","v":""}]
["End Description","end_desc","text",null,null,null,null,null,null,{"$f":"IF(minor_structures_key[[#This Row],[Factor]]=\"\",\"\",COLUMN(INDIRECT($A$169&$I377)))","v":""},null,null,"What NMA is the asset in?"]
["Type","ms-type","text",null,null,null,null,null,null,{"$f":"IF(minor_structures_key[[#This Row],[Factor]]=\"\",\"\",COLUMN(INDIRECT($A$169&$I378)))","v":""}]
["Subtype","ms_subtype","text",null,null,null,null,null,null,{"$f":"IF(minor_structures_key[[#This Row],[Factor]]=\"\",\"\",COLUMN(INDIRECT($A$169&$I379)))","v":""}]
["Quantity","quantity","number",null,null,null,null,null,null,{"$f":"IF(minor_structures_key[[#This Row],[Factor]]=\"\",\"\",COLUMN(INDIRECT($A$169&$I380)))","v":""}]
["Northing","northing","number",null,null,null,null,null,null,{"$f":"IF(minor_structures_key[[#This Row],[Factor]]=\"\",\"\",COLUMN(INDIRECT($A$169&$I381)))","v":""}]
["Easting","easting","number",null,null,null,null,null,null,{"$f":"IF(minor_structures_key[[#This Row],[Factor]]=\"\",\"\",COLUMN(INDIRECT($A$169&$I382)))","v":""}]
["Northing End","northing_end","number",null,null,null,null,null,null,{"$f":"IF(minor_structures_key[[#This Row],[Factor]]=\"\",\"\",COLUMN(INDIRECT($A$169&$I383)))","v":""}]
["Easting End","easting_end","number",null,null,null,null,null,null,{"$f":"IF(minor_structures_key[[#This Row],[Factor]]=\"\",\"\",COLUMN(INDIRECT($A$169&$I384)))","v":""}]
["GPS Date","gps_date","date",null,null,null,null,null,null,{"$f":"IF(minor_structures_key[[#This Row],[Factor]]=\"\",\"\",COLUMN(INDIRECT($A$169&$I385)))","v":""}]
["GPS Collected By","gps_by","text",null,null,null,null,null,null,{"$f":"IF(minor_structures_key[[#This Row],[Factor]]=\"\",\"\",COLUMN(INDIRECT($A$169&$I386)))","v":""}]
["GPS method","gps_method_id","text",null,null,null,null,null,null,{"$f":"IF(minor_structures_key[[#This Row],[Factor]]=\"\",\"\",COLUMN(INDIRECT($A$169&$I387)))","v":""}]
["side","side","text",null,null,null,null,null,null,{"$f":"IF(minor_structures_key[[#This Row],[Factor]]=\"\",\"\",COLUMN(INDIRECT($A$169&$I388)))","v":""}]
["Offset (Kerb)","offset_kerb","number",null,null,null,null,null,null,{"$f":"IF(minor_structures_key[[#This Row],[Factor]]=\"\",\"\",COLUMN(INDIRECT($A$169&$I389)))","v":""}]
["Offset","offset","number",null,null,null,null,null,null,{"$f":"IF(minor_structures_key[[#This Row],[Factor]]=\"\",\"\",COLUMN(INDIRECT($A$169&$I390)))","v":""}]
["Offset (LHS)","offset_lhs","number",null,null,null,null,null,null,{"$f":"IF(minor_structures_key[[#This Row],[Factor]]=\"\",\"\",COLUMN(INDIRECT($A$169&$I391)))","v":""}]
["Offset End (Kerb)","offset_kerb_end","number",null,null,null,null,null,null,{"$f":"IF(minor_structures_key[[#This Row],[Factor]]=\"\",\"\",COLUMN(INDIRECT($A$169&$I392)))","v":""}]
["Offset (End)","offset_end","number",null,null,null,null,null,null,{"$f":"IF(minor_structures_key[[#This Row],[Factor]]=\"\",\"\",COLUMN(INDIRECT($A$169&$I393)))","v":""}]
["Offset End (LHS)","offset_lhs_end","number",null,null,null,null,null,null,{"$f":"IF(minor_structures_key[[#This Row],[Factor]]=\"\",\"\",COLUMN(INDIRECT($A$169&$I394)))","v":""}]
["Length","length_m","auto",null,null,null,null,null,null,{"$f":"IF(minor_structures_key[[#This Row],[Factor]]=\"\",\"\",COLUMN(INDIRECT($A$169&$I395)))","v":""}]
["Adjustment","length_adjust_m","number",null,null,null,null,null,null,{"$f":"IF(minor_structures_key[[#This Row],[Factor]]=\"\",\"\",COLUMN(INDIRECT($A$169&$I396)))","v":""}]
["Adjustment Reason","len_adjust_rsn","text",null,null,null,null,null,null,{"$f":"IF(minor_structures_key[[#This Row],[Factor]]=\"\",\"\",COLUMN(INDIRECT($A$169&$I397)))","v":""}]
["Width","width","number",null,null,null,null,null,null,{"$f":"IF(minor_structures_key[[#This Row],[Factor]]=\"\",\"\",COLUMN(INDIRECT($A$169&$I398)))","v":""}]
["Height","height_m","number",null,null,null,null,null,null,{"$f":"IF(minor_structures_key[[#This Row],[Factor]]=\"\",\"\",COLUMN(INDIRECT($A$169&$I399)))","v":""}]
["Clearance","clearance","number",null,null,null,null,null,null,{"$f":"IF(minor_structures_key[[#This Row],[Factor]]=\"\",\"\",COLUMN(INDIRECT($A$169&$I400)))","v":""}]
["Area","area","number",null,null,null,null,null,null,{"$f":"IF(minor_structures_key[[#This Row],[Factor]]=\"\",\"\",COLUMN(INDIRECT($A$169&$I401)))","v":""}]
["Material","ms_material","text",null,null,null,null,null,null,{"$f":"IF(minor_structures_key[[#This Row],[Factor]]=\"\",\"\",COLUMN(INDIRECT($A$169&$I402)))","v":""}]
["House Number (start)","loc_house_start","number",null,null,null,null,null,null,{"$f":"IF(minor_structures_key[[#This Row],[Factor]]=\"\",\"\",COLUMN(INDIRECT($A$169&$I403)))","v":""}]
["House Number (end)","loc_house_end","number",null,null,null,null,null,null,{"$f":"IF(minor_structures_key[[#This Row],[Factor]]=\"\",\"\",COLUMN(INDIRECT($A$169&$I404)))","v":""}]
["Surface Treatment Code","ms_surf_treat","text",null,null,null,null,null,null,{"$f":"IF(minor_structures_key[[#This Row],[Factor]]=\"\",\"\",COLUMN(INDIRECT($A$169&$I405)))","v":""}]
["Colour","ms_colour","text",null,null,null,null,null,null,{"$f":"IF(minor_structures_key[[#This Row],[Factor]]=\"\",\"\",COLUMN(INDIRECT($A$169&$I406)))","v":""}]
["Style","ms_style","text",null,null,null,null,null,null,{"$f":"IF(minor_structures_key[[#This Row],[Factor]]=\"\",\"\",COLUMN(INDIRECT($A$169&$I407)))","v":""}]
["Lockable","lockable","text",null,null,null,null,null,null,{"$f":"IF(minor_structures_key[[#This Row],[Factor]]=\"\",\"\",COLUMN(INDIRECT($A$169&$I408)))","v":""}]
["Artist","artist_name","text",null,null,null,null,null,null,{"$f":"IF(minor_structures_key[[#This Row],[Factor]]=\"\",\"\",COLUMN(INDIRECT($A$169&$I409)))","v":""}]
["Tree Guard","tree_guard","text",null,null,null,null,null,null,{"$f":"IF(minor_structures_key[[#This Row],[Factor]]=\"\",\"\",COLUMN(INDIRECT($A$169&$I410)))","v":""}]
["External Number","external_no","text",null,null,null,null,null,null,{"$f":"IF(minor_structures_key[[#This Row],[Factor]]=\"\",\"\",COLUMN(INDIRECT($A$169&$I411)))","v":""}]
["Constructed Date","constructed","date",null,null,null,null,null,null,{"$f":"IF(minor_structures_key[[#This Row],[Factor]]=\"\",\"\",COLUMN(INDIRECT($A$169&$I412)))","v":""}]
["RUL reset","rul_reset","lookup","rul_reset",null,null,null,"Mandatory",null,{"$f":"IF(minor_structures_key[[#This Row],[Factor]]=\"\",\"\",COLUMN(INDIRECT($A$169&$I413)))","v":""}]
["Condition","condition","lookup","condition",null,"Y","U","Optional",null,{"$f":"IF(minor_structures_key[[#This Row],[Factor]]=\"\",\"\",COLUMN(INDIRECT($A$169&$I414)))","v":""}]
["Risk Likelihood","risk_likelihood","lookup","likelihood",null,"Y","U","Optional",null,{"$f":"IF(minor_structures_key[[#This Row],[Factor]]=\"\",\"\",COLUMN(INDIRECT($A$169&$I415)))","v":""}]
["Risk Consequence","risk_consequence","lookup","consequence",null,"Y","U","Optional",null,{"$f":"IF(minor_structures_key[[#This Row],[Factor]]=\"\",\"\",COLUMN(INDIRECT($A$169&$I416)))","v":""}]
["Failure Risk","risk","lookup","risk",null,"Y","U","Optional",null,{"$f":"IF(minor_structures_key[[#This Row],[Factor]]=\"\",\"\",COLUMN(INDIRECT($A$169&$I417)))","v":""}]
["Notes","notes","text",null,null,null,null,"Optional",null,{"$f":"IF(minor_structures_key[[#This Row],[Factor]]=\"\",\"\",COLUMN(INDIRECT($A$169&$I418)))","v":""}]
["Owner","asset_owner","lookup","asset_owner",null,null,null,"Mandatory",null,{"$f":"IF(minor_structures_key[[#This Row],[Factor]]=\"\",\"\",COLUMN(INDIRECT($A$169&$I419)))","v":""}]
["Cost","original_cost","number",null,null,null,null,"Mandatory",null,{"$f":"IF(minor_structures_key[[#This Row],[Factor]]=\"\",\"\",COLUMN(INDIRECT($A$169&$I420)))","v":""}]
["Pavement Test Pit"]
["Column Name","RAMM field name","Data Type","Lookup Table","Column1","Required by Software","Generated Value","Required by NZTA","Factor","Factor Address","Condition","Column2","Field Description","Allowable Values","Data Collection Notes","Database Management Guidance Notes"]
["Road ID","road_id","number",null,null,"Y",null,"Mandatory",null,{"$f":"IF(pavement_test_pit_key[[#This Row],[Factor]]=\"\",\"\",COLUMN(INDIRECT($A$169&$I423)))","v":""}]
["Owner","asset_owner","text",null,null,null,null,"Mandatory",null,{"$f":"IF(pavement_test_pit_key[[#This Row],[Factor]]=\"\",\"\",COLUMN(INDIRECT($A$169&$I424)))","v":""}]
["Layer","layer_type","text",null,null,"Y",null,null,null,{"$f":"IF(pavement_test_pit_key[[#This Row],[Factor]]=\"\",\"\",COLUMN(INDIRECT($A$169&$I425)))","v":""}]
["Start Depth","start_depth","number",null,null,null,null,null,null,{"$f":"IF(pavement_test_pit_key[[#This Row],[Factor]]=\"\",\"\",COLUMN(INDIRECT($A$169&$I426)))","v":""}]
["End Depth","end_depth","number",null,null,null,null,null,null,{"$f":"IF(pavement_test_pit_key[[#This Row],[Factor]]=\"\",\"\",COLUMN(INDIRECT($A$169&$I427)))","v":""}]
["Material","pave_material","text",null,null,null,null,null,null,{"$f":"IF(pavement_test_pit_key[[#This Row],[Factor]]=\"\",\"\",COLUMN(INDIRECT($A$169&$I428)))","v":""},null,null,"What NMA is the asset in?"]
["Subgrade","pave_subgrade","text",null,null,null,null,null,null,{"$f":"IF(pavement_test_pit_key[[#This Row],[Factor]]=\"\",\"\",COLUMN(INDIRECT($A$169&$I429)))","v":""}]
["Layer Strength","layer_strength","number",null,null,null,null,null,null,{"$f":"IF(pavement_test_pit_key[[#This Row],[Factor]]=\"\",\"\",COLUMN(INDIRECT($A$169&$I430)))","v":""}]
["CBR or UCS","cbr_ucs","text",null,null,null,null,null,null,{"$f":"IF(pavement_test_pit_key[[#This Row],[Factor]]=\"\",\"\",COLUMN(INDIRECT($A$169&$I431)))","v":""}]
["Stabilising Agent","pave_st_agent","text",null,null,null,null,null,null,{"$f":"IF(pavement_test_pit_key[[#This Row],[Factor]]=\"\",\"\",COLUMN(INDIRECT($A$169&$I432)))","v":""}]
["Notes","notes","text",null,null,null,null,null,null,{"$f":"IF(pavement_test_pit_key[[#This Row],[Factor]]=\"\",\"\",COLUMN(INDIRECT($A$169&$I433)))","v":""}]
["Retaining_Walls",null,null,null,null,null,null,null,null,{"$f":"IF(pavement_test_pit_key[[#This Row],[Factor]]=\"\",\"\",COLUMN(INDIRECT($A$169&$I434)))","v":""}]
["Column Name","RAMM field name","Data Type","Lookup Table","Column1","Required by Software","Generated Value","Required by NZTA","Factor","Factor Address","Condition","Column2","Field Description","Allowable Values","Data Collection Notes","Database Management Guidance Notes"]
["Road ID","road_id","number",null,null,"Y",null,"Mandatory",null,{"$f":"IF(retaining_walls_key[[#This Row],[Factor]]=\"\",\"\",COLUMN(INDIRECT($A$169&$I436)))","v":""}]
["Owner","asset_owner","lookup","asset_owner",null,null,null,"Mandatory",null,{"$f":"IF(retaining_walls_key[[#This Row],[Factor]]=\"\",\"\",COLUMN(INDIRECT($A$169&$I437)))","v":""}]
["Start","start_m","number",null,null,"Y",null,"Mandatory",null,{"$f":"IF(retaining_walls_key[[#This Row],[Factor]]=\"\",\"\",COLUMN(INDIRECT($A$169&$I438)))","v":""}]
["Start Description","start_desc","text",null,null,null,null,"Optional",null,{"$f":"IF(retaining_walls_key[[#This Row],[Factor]]=\"\",\"\",COLUMN(INDIRECT($A$169&$I439)))","v":""}]
["End ","end_m","number",null,null,null,null,"Mandatory",null,{"$f":"IF(retaining_walls_key[[#This Row],[Factor]]=\"\",\"\",COLUMN(INDIRECT($A$169&$I440)))","v":""}]
["End Description","end_desc","text",null,null,null,null,"Optional",null,{"$f":"IF(retaining_walls_key[[#This Row],[Factor]]=\"\",\"\",COLUMN(INDIRECT($A$169&$I441)))","v":""},null,null,"What NMA is the asset in?"]
["Retaining Wall Type","ret_wall_type","lookup","ret_wall_type",null,null,null,"Mandatory",null,{"$f":"IF(retaining_walls_key[[#This Row],[Factor]]=\"\",\"\",COLUMN(INDIRECT($A$169&$I442)))","v":""}]
["Quantity","quantity","number",null,null,"Y",1,"Optional",null,{"$f":"IF(retaining_walls_key[[#This Row],[Factor]]=\"\",\"\",COLUMN(INDIRECT($A$169&$I443)))","v":""}]
["Northing","northing","number",null,null,null,null,"Optional",null,{"$f":"IF(retaining_walls_key[[#This Row],[Factor]]=\"\",\"\",COLUMN(INDIRECT($A$169&$I444)))","v":""}]
["Easting","easting","number",null,null,null,null,"Optional",null,{"$f":"IF(retaining_walls_key[[#This Row],[Factor]]=\"\",\"\",COLUMN(INDIRECT($A$169&$I445)))","v":""}]
["Northing End","northing_end","text",null,null,null,null,"Optional",null,{"$f":"IF(retaining_walls_key[[#This Row],[Factor]]=\"\",\"\",COLUMN(INDIRECT($A$169&$I446)))","v":""}]
["Easting End","eastin_end","text",null,null,null,null,"Optional",null,{"$f":"IF(retaining_walls_key[[#This Row],[Factor]]=\"\",\"\",COLUMN(INDIRECT($A$169&$I447)))","v":""}]
["GPS Date","gps_date","date",null,null,null,null,"Optional",null,{"$f":"IF(retaining_walls_key[[#This Row],[Factor]]=\"\",\"\",COLUMN(INDIRECT($A$169&$I448)))","v":""}]
["GPS Organisation","gps_by","lookup","organisation",null,null,null,"Optional",null,{"$f":"IF(retaining_walls_key[[#This Row],[Factor]]=\"\",\"\",COLUMN(INDIRECT($A$169&$I449)))","v":""}]
["GPS Method","gps_method_id","lookup","gps_method",null,null,null,"Optional",null,{"$f":"IF(retaining_walls_key[[#This Row],[Factor]]=\"\",\"\",COLUMN(INDIRECT($A$169&$I450)))","v":""}]
["Side","side","lookup","rw_side",null,"Y",null,"Mandatory",null,{"$f":"IF(retaining_walls_key[[#This Row],[Factor]]=\"\",\"\",COLUMN(INDIRECT($A$169&$I451)))","v":""}]
["Offset (Kerb)","offset_kerb","number",null,null,null,null,"Optional",null,{"$f":"IF(retaining_walls_key[[#This Row],[Factor]]=\"\",\"\",COLUMN(INDIRECT($A$169&$I452)))","v":""}]
["Offset","offset","number",null,null,null,null,"Mandatory",null,{"$f":"IF(retaining_walls_key[[#This Row],[Factor]]=\"\",\"\",COLUMN(INDIRECT($A$169&$I453)))","v":""}]
["Offset (LHS)","offset_lhs","number",null,null,null,null,"Optional",null,{"$f":"IF(retaining_walls_key[[#This Row],[Factor]]=\"\",\"\",COLUMN(INDIRECT($A$169&$I454)))","v":""}]
["Offset End (Kerb)","offset_kerb_end","number",null,null,null,null,"Optional",null,{"$f":"IF(retaining_walls_key[[#This Row],[Factor]]=\"\",\"\",COLUMN(INDIRECT($A$169&$I455)))","v":""}]
["Offset (End)","offset_end","number",null,null,null,null,"Optional",null,{"$f":"IF(retaining_walls_key[[#This Row],[Factor]]=\"\",\"\",COLUMN(INDIRECT($A$169&$I456)))","v":""}]
["Offset End (LHS)","offset_lhs_end","number",null,null,null,null,"Optional",null,{"$f":"IF(retaining_walls_key[[#This Row],[Factor]]=\"\",\"\",COLUMN(INDIRECT($A$169&$I457)))","v":""}]
["Total Length","length_m","auto",null,null,null,null,"Mandatory",null,{"$f":"IF(retaining_walls_key[[#This Row],[Factor]]=\"\",\"\",COLUMN(INDIRECT($A$169&$I458)))","v":""}]
["Length Adjustment","length_adjust_m","number",null,null,null,null,"Optional",null,{"$f":"IF(retaining_walls_key[[#This Row],[Factor]]=\"\",\"\",COLUMN(INDIRECT($A$169&$I459)))","v":""}]
["Adjustment Reason","len_adjust_rsn","lookup","len_adjust_rsn",null,null,null,"Optional",null,{"$f":"IF(retaining_walls_key[[#This Row],[Factor]]=\"\",\"\",COLUMN(INDIRECT($A$169&$I460)))","v":""}]
["Width","width","number",null,null,null,null,"Optional",null,{"$f":"IF(retaining_walls_key[[#This Row],[Factor]]=\"\",\"\",COLUMN(INDIRECT($A$169&$I461)))","v":""}]
["Avg Height","height_m_avg","number",null,null,null,null,"Mandatory",null,{"$f":"IF(retaining_walls_key[[#This Row],[Factor]]=\"\",\"\",COLUMN(INDIRECT($A$169&$I462)))","v":""}]
["Min Height","height_m_min","number",null,null,null,null,"Optional",null,{"$f":"IF(retaining_walls_key[[#This Row],[Factor]]=\"\",\"\",COLUMN(INDIRECT($A$169&$I463)))","v":""}]
["Max Height","height_m_max","number",null,null,null,null,"Optional",null,{"$f":"IF(retaining_walls_key[[#This Row],[Factor]]=\"\",\"\",COLUMN(INDIRECT($A$169&$I464)))","v":""}]
["Area","area","number",null,null,null,null,"Optional",null,{"$f":"IF(retaining_walls_key[[#This Row],[Factor]]=\"\",\"\",COLUMN(INDIRECT($A$169&$I465)))","v":""}]
["Average Overburden","overburden_avg","number",null,null,null,null,"Optional",null,{"$f":"IF(retaining_walls_key[[#This Row],[Factor]]=\"\",\"\",COLUMN(INDIRECT($A$169&$I466)))","v":""}]
["Min Overburden","overburden_min","number",null,null,null,null,"Optional",null,{"$f":"IF(retaining_walls_key[[#This Row],[Factor]]=\"\",\"\",COLUMN(INDIRECT($A$169&$I467)))","v":""}]
["Max Overburden","overburdefn_max","number",null,null,null,null,"Optional",null,{"$f":"IF(retaining_walls_key[[#This Row],[Factor]]=\"\",\"\",COLUMN(INDIRECT($A$169&$I468)))","v":""}]
["Average Lean Angle","lean_angle_avg","number",null,null,null,null,"Optional",null,{"$f":"IF(retaining_walls_key[[#This Row],[Factor]]=\"\",\"\",COLUMN(INDIRECT($A$169&$I469)))","v":""}]
["Min Lean Angle","lean_angle_min","number",null,null,null,null,"Optional",null,{"$f":"IF(retaining_walls_key[[#This Row],[Factor]]=\"\",\"\",COLUMN(INDIRECT($A$169&$I470)))","v":""}]
["Max Lean Angle","lean_angle_max","number",null,null,null,null,"Optional",null,{"$f":"IF(retaining_walls_key[[#This Row],[Factor]]=\"\",\"\",COLUMN(INDIRECT($A$169&$I471)))","v":""}]
["Average Edgeline Offset (Above)","edge_offset_avg_a","number",null,null,null,null,"Optional",null,{"$f":"IF(retaining_walls_key[[#This Row],[Factor]]=\"\",\"\",COLUMN(INDIRECT($A$169&$I472)))","v":""}]
["Min Edgeline Offset (Above)","edge_offset_min_a","number",null,null,null,null,"Optional",null,{"$f":"IF(retaining_walls_key[[#This Row],[Factor]]=\"\",\"\",COLUMN(INDIRECT($A$169&$I473)))","v":""}]
["Max Edgeline Offset (Above)","edge_offset_max_a","number",null,null,null,null,"Optional",null,{"$f":"IF(retaining_walls_key[[#This Row],[Factor]]=\"\",\"\",COLUMN(INDIRECT($A$169&$I474)))","v":""}]
["Average Edgeline Offset (Below)","edge_offset_avg_b","number",null,null,null,null,"Optional",null,{"$f":"IF(retaining_walls_key[[#This Row],[Factor]]=\"\",\"\",COLUMN(INDIRECT($A$169&$I475)))","v":""}]
["Min Edgeline Offset (Below)","edge_offset_min_b","number",null,null,null,null,"Optional",null,{"$f":"IF(retaining_walls_key[[#This Row],[Factor]]=\"\",\"\",COLUMN(INDIRECT($A$169&$I476)))","v":""}]
["Max Edgeline Offset (Below)","edge_offset_max_b","number",null,null,null,null,"Optional",null,{"$f":"IF(retaining_walls_key[[#This Row],[Factor]]=\"\",\"\",COLUMN(INDIRECT($A$169&$I477)))","v":""}]
["Material","ms_material","lookup","ms_material",null,null,null,"Mandatory",null,{"$f":"IF(retaining_walls_key[[#This Row],[Factor]]=\"\",\"\",COLUMN(INDIRECT($A$169&$I478)))","v":""}]
["Land Use (Above)","land_use_above","text",null,null,null,null,"Optional",null,{"$f":"IF(retaining_walls_key[[#This Row],[Factor]]=\"\",\"\",COLUMN(INDIRECT($A$169&$I479)))","v":""}]
["Land Use (Below)","land_use_below","text",null,null,null,null,"Optional",null,{"$f":"IF(retaining_walls_key[[#This Row],[Factor]]=\"\",\"\",COLUMN(INDIRECT($A$169&$I480)))","v":""}]
["Wall Category","ret_wall_cat","lookup",null,null,null,null,"Optional",null,{"$f":"IF(retaining_walls_key[[#This Row],[Factor]]=\"\",\"\",COLUMN(INDIRECT($A$169&$I481)))","v":""}]
["Foundation","ret_wall_fnd","lookup",null,null,null,null,"Optional",null,{"$f":"IF(retaining_walls_key[[#This Row],[Factor]]=\"\",\"\",COLUMN(INDIRECT($A$169&$I482)))","v":""}]
["Constructed Date","constructed","date",null,null,null,null,"Mandatory",null,{"$f":"IF(retaining_walls_key[[#This Row],[Factor]]=\"\",\"\",COLUMN(INDIRECT($A$169&$I483)))","v":""}]
["Cost","original_cost","number",null,null,null,null,"Mandatory",null,{"$f":"IF(retaining_walls_key[[#This Row],[Factor]]=\"\",\"\",COLUMN(INDIRECT($A$169&$I484)))","v":""}]
["RUL reset","rul_reset","lookup","rul_reset",null,null,null,"Mandatory",null,{"$f":"IF(retaining_walls_key[[#This Row],[Factor]]=\"\",\"\",COLUMN(INDIRECT($A$169&$I485)))","v":""}]
["Condition","condition","lookup","condition",null,"Y","U","Optional",null,{"$f":"IF(retaining_walls_key[[#This Row],[Factor]]=\"\",\"\",COLUMN(INDIRECT($A$169&$I486)))","v":""}]
["Risk Likelihood","risk_likelihood","lookup","likelihood",null,"Y","U","Optional",null,{"$f":"IF(retaining_walls_key[[#This Row],[Factor]]=\"\",\"\",COLUMN(INDIRECT($A$169&$I487)))","v":""}]
["Risk Consequence","risk_consequence","lookup","consequence",null,"Y","U","Optional",null,{"$f":"IF(retaining_walls_key[[#This Row],[Factor]]=\"\",\"\",COLUMN(INDIRECT($A$169&$I488)))","v":""}]
["Failure Risk","risk","lookup","risk",null,"Y","U","Optional",null,{"$f":"IF(retaining_walls_key[[#This Row],[Factor]]=\"\",\"\",COLUMN(INDIRECT($A$169&$I489)))","v":""}]
["Notes","notes","text",null,null,null,null,"Optional",null,{"$f":"IF(retaining_walls_key[[#This Row],[Factor]]=\"\",\"\",COLUMN(INDIRECT($A$169&$I490)))","v":""}]
["Calc Length",null,"number",null,null,null,null,"Mandatory",null,{"$f":"IF(retaining_walls_key[[#This Row],[Factor]]=\"\",\"\",COLUMN(INDIRECT($A$169&$I491)))","v":""}]
["Shoulder"]
["Column Name","RAMM field name","Data Type","Lookup Table","Column1","Required by Software","Generated Value","Required by NZTA","Factor","Factor Address","Condition","Column2","Field Description","Allowable Values","Data Collection Notes","Database Management Guidance Notes"]
["Road ID","road_id","number",null,null,"Y",null,"Mandatory",null,{"$f":"IF(shoulders_key[[#This Row],[Factor]]=\"\",\"\",COLUMN(INDIRECT($A$169&$I494)))","v":""}]
["Owner","asset_owner","text",null,null,null,null,"Mandatory",null,{"$f":"IF(shoulders_key[[#This Row],[Factor]]=\"\",\"\",COLUMN(INDIRECT($A$169&$I495)))","v":""}]
["Start","start_m","number",null,null,"Y",null,null,null,{"$f":"IF(shoulders_key[[#This Row],[Factor]]=\"\",\"\",COLUMN(INDIRECT($A$169&$I496)))","v":""}]
["End","end_m","number",null,null,null,null,null,null,{"$f":"IF(shoulders_key[[#This Row],[Factor]]=\"\",\"\",COLUMN(INDIRECT($A$169&$I497)))","v":""}]
["Side","side","text",null,null,null,null,null,null,{"$f":"IF(shoulders_key[[#This Row],[Factor]]=\"\",\"\",COLUMN(INDIRECT($A$169&$I498)))","v":""}]
["Offset","offset","number",null,null,null,null,null,null,{"$f":"IF(shoulders_key[[#This Row],[Factor]]=\"\",\"\",COLUMN(INDIRECT($A$169&$I499)))","v":""},null,null,"What NMA is the asset in?"]
["Northing","northing","number",null,null,null,null,null,null,{"$f":"IF(shoulders_key[[#This Row],[Factor]]=\"\",\"\",COLUMN(INDIRECT($A$169&$I500)))","v":""}]
["Easting","easting","number",null,null,null,null,null,null,{"$f":"IF(shoulders_key[[#This Row],[Factor]]=\"\",\"\",COLUMN(INDIRECT($A$169&$I501)))","v":""}]
["Northing End","northing_end","number",null,null,null,null,null,null,{"$f":"IF(shoulders_key[[#This Row],[Factor]]=\"\",\"\",COLUMN(INDIRECT($A$169&$I502)))","v":""}]
["Easting End","easting_end","number",null,null,null,null,null,null,{"$f":"IF(shoulders_key[[#This Row],[Factor]]=\"\",\"\",COLUMN(INDIRECT($A$169&$I503)))","v":""}]
["GPS Date","gps_date","date",null,null,null,null,null,null,{"$f":"IF(shoulders_key[[#This Row],[Factor]]=\"\",\"\",COLUMN(INDIRECT($A$169&$I504)))","v":""}]
["GPS Organisation","gps_by","text",null,null,null,null,null,null,{"$f":"IF(shoulders_key[[#This Row],[Factor]]=\"\",\"\",COLUMN(INDIRECT($A$169&$I505)))","v":""}]
["GPS Method","gps_method_id","number",null,null,null,null,null,null,{"$f":"IF(shoulders_key[[#This Row],[Factor]]=\"\",\"\",COLUMN(INDIRECT($A$169&$I506)))","v":""}]
["Length","length_m","number",null,null,null,null,null,null,{"$f":"IF(shoulders_key[[#This Row],[Factor]]=\"\",\"\",COLUMN(INDIRECT($A$169&$I507)))","v":""}]
["Length Adjustment","length_adjust_m","number",null,null,null,null,null,null,{"$f":"IF(shoulders_key[[#This Row],[Factor]]=\"\",\"\",COLUMN(INDIRECT($A$169&$I508)))","v":""}]
["Reason","len_adjust_rsn","text",null,null,null,null,null,null,{"$f":"IF(shoulders_key[[#This Row],[Factor]]=\"\",\"\",COLUMN(INDIRECT($A$169&$I509)))","v":""}]
["Width","width","number",null,null,null,null,null,null,{"$f":"IF(shoulders_key[[#This Row],[Factor]]=\"\",\"\",COLUMN(INDIRECT($A$169&$I510)))","v":""}]
["Material","material","text",null,null,null,null,null,null,{"$f":"IF(shoulders_key[[#This Row],[Factor]]=\"\",\"\",COLUMN(INDIRECT($A$169&$I511)))","v":""}]
["Last Maintained","maint_date","date",null,null,null,null,null,null,{"$f":"IF(shoulders_key[[#This Row],[Factor]]=\"\",\"\",COLUMN(INDIRECT($A$169&$I512)))","v":""}]
["Maintenance Cycle","maint_cycle","number",null,null,null,null,null,null,{"$f":"IF(shoulders_key[[#This Row],[Factor]]=\"\",\"\",COLUMN(INDIRECT($A$169&$I513)))","v":""}]
["Constructed Date","constructed","date",null,null,null,null,null,null,{"$f":"IF(shoulders_key[[#This Row],[Factor]]=\"\",\"\",COLUMN(INDIRECT($A$169&$I514)))","v":""}]
["RUL reset","rul_reset","lookup","rul_reset",null,null,null,null,null,{"$f":"IF(shoulders_key[[#This Row],[Factor]]=\"\",\"\",COLUMN(INDIRECT($A$169&$I515)))","v":""}]
["Condition","condition","lookup","condition",null,null,null,null,null,{"$f":"IF(shoulders_key[[#This Row],[Factor]]=\"\",\"\",COLUMN(INDIRECT($A$169&$I516)))","v":""}]
["Risk Likelihood","risk_likelihood","lookup","likelihood",null,null,null,null,null,{"$f":"IF(shoulders_key[[#This Row],[Factor]]=\"\",\"\",COLUMN(INDIRECT($A$169&$I517)))","v":""}]
["Risk Consequence","risk_consequence","lookup","consequence",null,null,null,null,null,{"$f":"IF(shoulders_key[[#This Row],[Factor]]=\"\",\"\",COLUMN(INDIRECT($A$169&$I518)))","v":""}]
["Failure Risk","risk","lookup","risk",null,null,null,null,null,{"$f":"IF(shoulders_key[[#This Row],[Factor]]=\"\",\"\",COLUMN(INDIRECT($A$169&$I519)))","v":""}]
["Notes","notes","text",null,null,null,null,null,null,{"$f":"IF(shoulders_key[[#This Row],[Factor]]=\"\",\"\",COLUMN(INDIRECT($A$169&$I520)))","v":""}]
["Trees"]
["Column Name","RAMM field name","Data Type","Lookup Table","Column1","Required by Software","Generated Value","Required by NZTA","Factor","Factor Address","Condition","Column2","Field Description","Allowable Values","Data Collection Notes","Database Management Guidance Notes"]
["Road ID","road_id","number",null,null,"Y",null,"Mandatory",null,{"$f":"IF(trees_key[[#This Row],[Factor]]=\"\",\"\",COLUMN(INDIRECT($A$169&$I523)))","v":""}]
["Owner","asset_owner","text",null,null,null,null,"Mandatory",null,{"$f":"IF(trees_key[[#This Row],[Factor]]=\"\",\"\",COLUMN(INDIRECT($A$169&$I524)))","v":""}]
["Location","location","number",null,null,"Y",null,null,null,{"$f":"IF(trees_key[[#This Row],[Factor]]=\"\",\"\",COLUMN(INDIRECT($A$169&$I525)))","v":""}]
["Side","side","text",null,null,null,null,null,null,{"$f":"IF(trees_key[[#This Row],[Factor]]=\"\",\"\",COLUMN(INDIRECT($A$169&$I526)))","v":""}]
["Offset (Kerb)","offset_kerb","number",null,null,null,null,null,null,{"$f":"IF(trees_key[[#This Row],[Factor]]=\"\",\"\",COLUMN(INDIRECT($A$169&$I527)))","v":""}]
["Offset","offset","number",null,null,null,null,null,null,{"$f":"IF(trees_key[[#This Row],[Factor]]=\"\",\"\",COLUMN(INDIRECT($A$169&$I528)))","v":""},null,null,"What NMA is the asset in?"]
["Offset (LHS)","offset_lhs","number",null,null,null,null,null,null,{"$f":"IF(trees_key[[#This Row],[Factor]]=\"\",\"\",COLUMN(INDIRECT($A$169&$I529)))","v":""}]
["Tree Position","tree_position","text",null,null,null,null,null,null,{"$f":"IF(trees_key[[#This Row],[Factor]]=\"\",\"\",COLUMN(INDIRECT($A$169&$I530)))","v":""}]
["Dist to Boundary","dist_to_boundary","number",null,null,null,null,null,null,{"$f":"IF(trees_key[[#This Row],[Factor]]=\"\",\"\",COLUMN(INDIRECT($A$169&$I531)))","v":""}]
["Dist to Crossing","dist_to_crossing","number",null,null,null,null,null,null,{"$f":"IF(trees_key[[#This Row],[Factor]]=\"\",\"\",COLUMN(INDIRECT($A$169&$I532)))","v":""}]
["Dist to SW outlet","dist_to_swoutlet","number",null,null,null,null,null,null,{"$f":"IF(trees_key[[#This Row],[Factor]]=\"\",\"\",COLUMN(INDIRECT($A$169&$I533)))","v":""}]
["Dist to Street Light","dist_to_stlight","number",null,null,null,null,null,null,{"$f":"IF(trees_key[[#This Row],[Factor]]=\"\",\"\",COLUMN(INDIRECT($A$169&$I534)))","v":""}]
["Dist to Traffic Light","dist_to_traflight","number",null,null,null,null,null,null,{"$f":"IF(trees_key[[#This Row],[Factor]]=\"\",\"\",COLUMN(INDIRECT($A$169&$I535)))","v":""}]
["Dist to Sign","dist_to_sign","number",null,null,null,null,null,null,{"$f":"IF(trees_key[[#This Row],[Factor]]=\"\",\"\",COLUMN(INDIRECT($A$169&$I536)))","v":""}]
["Land Usage","land_use","text",null,null,null,null,null,null,{"$f":"IF(trees_key[[#This Row],[Factor]]=\"\",\"\",COLUMN(INDIRECT($A$169&$I537)))","v":""}]
["Nearest Feature","feature","text",null,null,null,null,null,null,{"$f":"IF(trees_key[[#This Row],[Factor]]=\"\",\"\",COLUMN(INDIRECT($A$169&$I538)))","v":""}]
["Closest House Number","loc_house_no","text",null,null,null,null,null,null,{"$f":"IF(trees_key[[#This Row],[Factor]]=\"\",\"\",COLUMN(INDIRECT($A$169&$I539)))","v":""}]
["Species","species","text",null,null,null,null,null,null,{"$f":"IF(trees_key[[#This Row],[Factor]]=\"\",\"\",COLUMN(INDIRECT($A$169&$I540)))","v":""}]
["Planting Medium","plant_medium","text",null,null,null,null,null,null,{"$f":"IF(trees_key[[#This Row],[Factor]]=\"\",\"\",COLUMN(INDIRECT($A$169&$I541)))","v":""}]
["Medium Description ","plant_medium_desc","text",null,null,null,null,null,null,{"$f":"IF(trees_key[[#This Row],[Factor]]=\"\",\"\",COLUMN(INDIRECT($A$169&$I542)))","v":""}]
["Tree Grate","tree_grate","text",null,null,null,null,null,null,{"$f":"IF(trees_key[[#This Row],[Factor]]=\"\",\"\",COLUMN(INDIRECT($A$169&$I543)))","v":""}]
["Grove or Species?","plant_type","text",null,null,null,null,null,null,{"$f":"IF(trees_key[[#This Row],[Factor]]=\"\",\"\",COLUMN(INDIRECT($A$169&$I544)))","v":""}]
["Overhead Wires?","overhead_wires","text",null,null,null,null,null,null,{"$f":"IF(trees_key[[#This Row],[Factor]]=\"\",\"\",COLUMN(INDIRECT($A$169&$I545)))","v":""}]
["Conflicting Wires","wire_conflict","text",null,null,null,null,null,null,{"$f":"IF(trees_key[[#This Row],[Factor]]=\"\",\"\",COLUMN(INDIRECT($A$169&$I546)))","v":""}]
["Survey Date","survey_date","date",null,null,null,null,null,null,{"$f":"IF(trees_key[[#This Row],[Factor]]=\"\",\"\",COLUMN(INDIRECT($A$169&$I547)))","v":""}]
["Year of Planting","planting_year","number",null,null,null,null,null,null,{"$f":"IF(trees_key[[#This Row],[Factor]]=\"\",\"\",COLUMN(INDIRECT($A$169&$I548)))","v":""}]
["Tree Height","tree_height","number",null,null,null,null,null,null,{"$f":"IF(trees_key[[#This Row],[Factor]]=\"\",\"\",COLUMN(INDIRECT($A$169&$I549)))","v":""}]
["Trunk Diameter","trunk_diameter","number",null,null,null,null,null,null,{"$f":"IF(trees_key[[#This Row],[Factor]]=\"\",\"\",COLUMN(INDIRECT($A$169&$I550)))","v":""}]
["Crown Diameter","crown_diameter","number",null,null,null,null,null,null,{"$f":"IF(trees_key[[#This Row],[Factor]]=\"\",\"\",COLUMN(INDIRECT($A$169&$I551)))","v":""}]
["% Dead Wood","dead_wood","number",null,null,null,null,null,null,{"$f":"IF(trees_key[[#This Row],[Factor]]=\"\",\"\",COLUMN(INDIRECT($A$169&$I552)))","v":""}]
["Crown Attention?","crown_attention","text",null,null,null,null,null,null,{"$f":"IF(trees_key[[#This Row],[Factor]]=\"\",\"\",COLUMN(INDIRECT($A$169&$I553)))","v":""}]
["Trunk Attention?","trunk_attention","text",null,null,null,null,null,null,{"$f":"IF(trees_key[[#This Row],[Factor]]=\"\",\"\",COLUMN(INDIRECT($A$169&$I554)))","v":""}]
["Root Attention?","root_attention","text",null,null,null,null,null,null,{"$f":"IF(trees_key[[#This Row],[Factor]]=\"\",\"\",COLUMN(INDIRECT($A$169&$I555)))","v":""}]
["Pest Attention?","pest_attention","text",null,null,null,null,null,null,{"$f":"IF(trees_key[[#This Row],[Factor]]=\"\",\"\",COLUMN(INDIRECT($A$169&$I556)))","v":""}]
["Tree Damage?","damage_caused","text",null,null,null,null,null,null,{"$f":"IF(trees_key[[#This Row],[Factor]]=\"\",\"\",COLUMN(INDIRECT($A$169&$I557)))","v":""}]
["Damage to?","damage_to","text",null,null,null,null,null,null,{"$f":"IF(trees_key[[#This Row],[Factor]]=\"\",\"\",COLUMN(INDIRECT($A$169&$I558)))","v":""}]
["Notes","notes","text",null,null,null,null,null,null,{"$f":"IF(trees_key[[#This Row],[Factor]]=\"\",\"\",COLUMN(INDIRECT($A$169&$I559)))","v":""}]
["Cost","original_cost","number",null,null,null,null,null,null,{"$f":"IF(trees_key[[#This Row],[Factor]]=\"\",\"\",COLUMN(INDIRECT($A$169&$I560)))","v":""}]
["SL_Bracket"]
["Column Name","RAMM field name","Data Type","Lookup Table","Column1","Required by Software","Generated Value","Required by NZTA","Factor","Factor Address","Condition","Column2","Field Description","Allowable Values","Data Collection Notes","Database Management Guidance Notes"]
["Road ID","road_id","number",null,null,"Y",null,"Mandatory",null,{"$f":"IF(sl_bracket_key[[#This Row],[Factor]]=\"\",\"\",COLUMN(INDIRECT($A$169&$I563)))","v":""}]
["Pole ID","pole_id","number",null,null,"Y",null,"Mandatory",null,{"$f":"IF(sl_bracket_key[[#This Row],[Factor]]=\"\",\"\",COLUMN(INDIRECT($A$169&$I564)))","v":""}]
["Backet Type","bracket_type","lookup","bracket_type",null,"Y",null,"Mandatory",null,{"$f":"IF(sl_bracket_key[[#This Row],[Factor]]=\"\",\"\",COLUMN(INDIRECT($A$169&$I565)))","v":""}]
["Bracket Angle","bracket_angle","number",null,null,null,null,"Mandatory",null,{"$f":"IF(sl_bracket_key[[#This Row],[Factor]]=\"\",\"\",COLUMN(INDIRECT($A$169&$I566)))","v":""}]
["Bracket Height","bracket_height","number",null,null,null,null,"Mandatory",null,{"$f":"IF(sl_bracket_key[[#This Row],[Factor]]=\"\",\"\",COLUMN(INDIRECT($A$169&$I567)))","v":""}]
["Outreach","outreach","number",null,null,null,null,"Mandatory",null,{"$f":"IF(sl_bracket_key[[#This Row],[Factor]]=\"\",\"\",COLUMN(INDIRECT($A$169&$I568)))","v":""}]
["Coating","coating","lookup","sl_coating",null,null,null,"Mandatory",null,{"$f":"IF(sl_bracket_key[[#This Row],[Factor]]=\"\",\"\",COLUMN(INDIRECT($A$169&$I569)))","v":""}]
["Colour","bracket_colour","text",null,null,null,null,"Mandatory",null,{"$f":"IF(sl_bracket_key[[#This Row],[Factor]]=\"\",\"\",COLUMN(INDIRECT($A$169&$I570)))","v":""}]
["Install Date","install_date","date",null,null,null,null,"Mandatory",null,{"$f":"IF(sl_bracket_key[[#This Row],[Factor]]=\"\",\"\",COLUMN(INDIRECT($A$169&$I571)))","v":""}]
["Owner","owner","lookup","sl_owner",null,null,null,"Mandatory",null,{"$f":"IF(sl_bracket_key[[#This Row],[Factor]]=\"\",\"\",COLUMN(INDIRECT($A$169&$I572)))","v":""}]
["Original Cost","original_cost","number",null,null,null,null,"Mandatory",null,{"$f":"IF(sl_bracket_key[[#This Row],[Factor]]=\"\",\"\",COLUMN(INDIRECT($A$169&$I573)))","v":""}]
["Notes","notes","text",null,null,null,null,"Optional",null,{"$f":"IF(sl_bracket_key[[#This Row],[Factor]]=\"\",\"\",COLUMN(INDIRECT($A$169&$I574)))","v":""}]
["SL_Light"]
["Column Name","RAMM field name","Data Type","Lookup Table","Column1","Required by Software","Generated Value","Required by NZTA","Factor","Factor Address","Condition","Column2","Field Description","Allowable Values","Data Collection Notes","Database Management Guidance Notes"]
["Light ID","light_id","number",null,null,null,null,null,null,{"$f":"IF(sl_light_key[[#This Row],[Factor]]=\"\",\"\",COLUMN(INDIRECT($A$169&$I577)))","v":""}]
["Road ID","road_id","number",null,null,"Y",null,"Mandatory",null,{"$f":"IF(sl_light_key[[#This Row],[Factor]]=\"\",\"\",COLUMN(INDIRECT($A$169&$I578)))","v":""}]
["Bracket ID","bracket_id","number",null,null,null,null,"Mandatory",null,{"$f":"IF(sl_light_key[[#This Row],[Factor]]=\"\",\"\",COLUMN(INDIRECT($A$169&$I579)))","v":""}]
["Light Owner","owner","lookup","sl_owner",null,null,null,"Mandatory",null,{"$f":"IF(sl_light_key[[#This Row],[Factor]]=\"\",\"\",COLUMN(INDIRECT($A$169&$I580)))","v":""}]
["Light Manufacturer","light_make","lookup","light_make",null,null,null,"Mandatory",null,{"$f":"IF(sl_light_key[[#This Row],[Factor]]=\"\",\"\",COLUMN(INDIRECT($A$169&$I581)))","v":""}]
["Model","light_model","lookup","light_model",null,null,null,"Mandatory",null,{"$f":"IF(sl_light_key[[#This Row],[Factor]]=\"\",\"\",COLUMN(INDIRECT($A$169&$I582)))","v":""}]
["Light Install Date","light_install_date","date",null,null,null,null,"Mandatory",null,{"$f":"IF(sl_light_key[[#This Row],[Factor]]=\"\",\"\",COLUMN(INDIRECT($A$169&$I583)))","v":""}]
["Tilt","light_tilt","number",null,null,null,null,"Mandatory",null,{"$f":"IF(sl_light_key[[#This Row],[Factor]]=\"\",\"\",COLUMN(INDIRECT($A$169&$I584)))","v":""}]
["Supply Point","supply_point","lookup","supply_point",null,"Y",null,"Mandatory",null,{"$f":"IF(sl_light_key[[#This Row],[Factor]]=\"\",\"\",COLUMN(INDIRECT($A$169&$I585)))","v":""}]
["Colour","light_colour","text",null,null,null,null,"Optional",null,{"$f":"IF(sl_light_key[[#This Row],[Factor]]=\"\",\"\",COLUMN(INDIRECT($A$169&$I586)))","v":""}]
["Shade","light_shade","lookup","light_shade",null,null,null,"Optional",null,{"$f":"IF(sl_light_key[[#This Row],[Factor]]=\"\",\"\",COLUMN(INDIRECT($A$169&$I587)))","v":""}]
["Coating","coating","lookup",null,null,null,null,"Optional",null,{"$f":"IF(sl_light_key[[#This Row],[Factor]]=\"\",\"\",COLUMN(INDIRECT($A$169&$I588)))","v":""}]
["Gear Manufacturer","gear_make","lookup",null,null,null,null,"Mandatory",null,{"$f":"IF(sl_light_key[[#This Row],[Factor]]=\"\",\"\",COLUMN(INDIRECT($A$169&$I589)))","v":""}]
["Gear Model","gear_model","lookup",null,null,null,null,"Mandatory",null,{"$f":"IF(sl_light_key[[#This Row],[Factor]]=\"\",\"\",COLUMN(INDIRECT($A$169&$I590)))","v":""}]
["Ballast","ballast","lookup",null,null,null,null,"Optional",null,{"$f":"IF(sl_light_key[[#This Row],[Factor]]=\"\",\"\",COLUMN(INDIRECT($A$169&$I591)))","v":""}]
["Ignitor","ignitor","lookup",null,null,null,null,"Optional",null,{"$f":"IF(sl_light_key[[#This Row],[Factor]]=\"\",\"\",COLUMN(INDIRECT($A$169&$I592)))","v":""}]
["Capacitor","capacitor","lookup",null,null,null,null,"Optional",null,{"$f":"IF(sl_light_key[[#This Row],[Factor]]=\"\",\"\",COLUMN(INDIRECT($A$169&$I593)))","v":""}]
["Gear Install Date","gear_install_date","date",null,null,null,null,"Mandatory",null,{"$f":"IF(sl_light_key[[#This Row],[Factor]]=\"\",\"\",COLUMN(INDIRECT($A$169&$I594)))","v":""}]
["Lamp Manufacturer","lamp_make","date",null,null,null,null,"Mandatory",null,{"$f":"IF(sl_light_key[[#This Row],[Factor]]=\"\",\"\",COLUMN(INDIRECT($A$169&$I595)))","v":""}]
["Lamp Model","lamp_model","lookup",null,null,null,null,"Mandatory",null,{"$f":"IF(sl_light_key[[#This Row],[Factor]]=\"\",\"\",COLUMN(INDIRECT($A$169&$I596)))","v":""}]
["Lamp Install Date","lamp_install_date","date",null,null,null,null,"Mandatory",null,{"$f":"IF(sl_light_key[[#This Row],[Factor]]=\"\",\"\",COLUMN(INDIRECT($A$169&$I597)))","v":""}]
["Original Cost","original_cost","Number",null,null,null,null,"Mandatory",null,{"$f":"IF(sl_light_key[[#This Row],[Factor]]=\"\",\"\",COLUMN(INDIRECT($A$169&$I598)))","v":""}]
["Light Notes","light_notes","text",null,null,null,null,"Optional",null,{"$f":"IF(sl_light_key[[#This Row],[Factor]]=\"\",\"\",COLUMN(INDIRECT($A$169&$I599)))","v":""}]
["Gear Notes","gear_notes","text",null,null,null,null,"Optional",null,{"$f":"IF(sl_light_key[[#This Row],[Factor]]=\"\",\"\",COLUMN(INDIRECT($A$169&$I600)))","v":""}]
["Lamp Notes","lamp_notes","text",null,null,null,null,"Optional",null,{"$f":"IF(sl_light_key[[#This Row],[Factor]]=\"\",\"\",COLUMN(INDIRECT($A$169&$I601)))","v":""}]
["Collect Organisation","collect_name","text",null,null,null,null,"Mandatory",null,{"$f":"IF(sl_light_key[[#This Row],[Factor]]=\"\",\"\",COLUMN(INDIRECT($A$169&$I602)))","v":""}]
["Collect Date","collect_date","date",null,null,null,null,"Mandatory",null,{"$f":"IF(sl_light_key[[#This Row],[Factor]]=\"\",\"\",COLUMN(INDIRECT($A$169&$I603)))","v":""}]
["light_status","light_status","text","status",null,"Y","N","Optional",null,{"$f":"IF(sl_light_key[[#This Row],[Factor]]=\"\",\"\",COLUMN(INDIRECT($A$169&$I604)))","v":""}]
["light_supply_point","light_supply_point","text",null,null,null,null,"Optional",null,{"$f":"IF(sl_light_key[[#This Row],[Factor]]=\"\",\"\",COLUMN(INDIRECT($A$169&$I605)))","v":""}]
["light_in_reason","light_in_reason","text",null,null,null,null,"Optional",null,{"$f":"IF(sl_light_key[[#This Row],[Factor]]=\"\",\"\",COLUMN(INDIRECT($A$169&$I606)))","v":""}]
["light_in_cont_id","light_in_cont_id","text",null,null,null,null,"Optional",null,{"$f":"IF(sl_light_key[[#This Row],[Factor]]=\"\",\"\",COLUMN(INDIRECT($A$169&$I607)))","v":""}]
["light_in_disp_id","light_in_disp_id","text",null,null,null,null,"Optional",null,{"$f":"IF(sl_light_key[[#This Row],[Factor]]=\"\",\"\",COLUMN(INDIRECT($A$169&$I608)))","v":""}]
["light_age","light_age","text",null,null,null,null,"Optional",null,{"$f":"IF(sl_light_key[[#This Row],[Factor]]=\"\",\"\",COLUMN(INDIRECT($A$169&$I609)))","v":""}]
["light_replace_date","light_replace_date","text",null,null,null,null,"Optional",null,{"$f":"IF(sl_light_key[[#This Row],[Factor]]=\"\",\"\",COLUMN(INDIRECT($A$169&$I610)))","v":""}]
["light_rep_reason","light_rep_reason","text",null,null,null,null,"Optional",null,{"$f":"IF(sl_light_key[[#This Row],[Factor]]=\"\",\"\",COLUMN(INDIRECT($A$169&$I611)))","v":""}]
["light_rep_cont_id","light_rep_cont_id","text",null,null,null,null,"Optional",null,{"$f":"IF(sl_light_key[[#This Row],[Factor]]=\"\",\"\",COLUMN(INDIRECT($A$169&$I612)))","v":""}]
["light_rep_disp_id","light_rep_disp_id","text",null,null,null,null,"Optional",null,{"$f":"IF(sl_light_key[[#This Row],[Factor]]=\"\",\"\",COLUMN(INDIRECT($A$169&$I613)))","v":""}]
["gear_status","gear_status","text","status",null,"Y","N","Optional",null,{"$f":"IF(sl_light_key[[#This Row],[Factor]]=\"\",\"\",COLUMN(INDIRECT($A$169&$I614)))","v":""}]
["gear_in_reason","gear_in_reason","text",null,null,null,null,null,null,{"$f":"IF(sl_light_key[[#This Row],[Factor]]=\"\",\"\",COLUMN(INDIRECT($A$169&$I615)))","v":""}]
["gear_in_cont_id","gear_in_cont_id","text",null,null,null,null,null,null,{"$f":"IF(sl_light_key[[#This Row],[Factor]]=\"\",\"\",COLUMN(INDIRECT($A$169&$I616)))","v":""}]
["gear_in_disp_id","gear_in_disp_id","text",null,null,null,null,null,null,{"$f":"IF(sl_light_key[[#This Row],[Factor]]=\"\",\"\",COLUMN(INDIRECT($A$169&$I617)))","v":""}]
["gear_age","gear_age","text",null,null,null,null,null,null,{"$f":"IF(sl_light_key[[#This Row],[Factor]]=\"\",\"\",COLUMN(INDIRECT($A$169&$I618)))","v":""}]
["gear_replace_date","gear_replace_date","text",null,null,null,null,null,null,{"$f":"IF(sl_light_key[[#This Row],[Factor]]=\"\",\"\",COLUMN(INDIRECT($A$169&$I619)))","v":""}]
["gear_rep_reason","gear_rep_reason","text",null,null,null,null,null,null,{"$f":"IF(sl_light_key[[#This Row],[Factor]]=\"\",\"\",COLUMN(INDIRECT($A$169&$I620)))","v":""}]
["gear_rep_cont_id","gear_rep_cont_id","text",null,null,null,null,null,null,{"$f":"IF(sl_light_key[[#This Row],[Factor]]=\"\",\"\",COLUMN(INDIRECT($A$169&$I621)))","v":""}]
["gear_rep_disp_id","gear_rep_disp_id","text",null,null,null,null,null,null,{"$f":"IF(sl_light_key[[#This Row],[Factor]]=\"\",\"\",COLUMN(INDIRECT($A$169&$I622)))","v":""}]
["lamp_in_reason","lamp_in_reason","text",null,null,null,null,null,null,{"$f":"IF(sl_light_key[[#This Row],[Factor]]=\"\",\"\",COLUMN(INDIRECT($A$169&$I623)))","v":""}]
["lamp_in_cont_id","lamp_in_cont_id","text",null,null,null,null,null,null,{"$f":"IF(sl_light_key[[#This Row],[Factor]]=\"\",\"\",COLUMN(INDIRECT($A$169&$I624)))","v":""}]
["lamp_in_disp_id","lamp_in_disp_id","text",null,null,null,null,null,null,{"$f":"IF(sl_light_key[[#This Row],[Factor]]=\"\",\"\",COLUMN(INDIRECT($A$169&$I625)))","v":""}]
["lamp_age","lamp_age","text",null,null,null,null,null,null,{"$f":"IF(sl_light_key[[#This Row],[Factor]]=\"\",\"\",COLUMN(INDIRECT($A$169&$I626)))","v":""}]
["lamp_replace_date","lamp_replace_date","text",null,null,null,null,null,null,{"$f":"IF(sl_light_key[[#This Row],[Factor]]=\"\",\"\",COLUMN(INDIRECT($A$169&$I627)))","v":""}]
["lamp_rep_reason","lamp_rep_reason","text",null,null,null,null,null,null,{"$f":"IF(sl_light_key[[#This Row],[Factor]]=\"\",\"\",COLUMN(INDIRECT($A$169&$I628)))","v":""}]
["lamp_rep_cont_id","lamp_rep_cont_id","text",null,null,null,null,null,null,{"$f":"IF(sl_light_key[[#This Row],[Factor]]=\"\",\"\",COLUMN(INDIRECT($A$169&$I629)))","v":""}]
["lamp_rep_disp_id","lamp_rep_disp_id","text",null,null,null,null,null,null,{"$f":"IF(sl_light_key[[#This Row],[Factor]]=\"\",\"\",COLUMN(INDIRECT($A$169&$I630)))","v":""}]
["last_cleaned_dt","last_cleaned_dt","text",null,null,null,null,null,null,{"$f":"IF(sl_light_key[[#This Row],[Factor]]=\"\",\"\",COLUMN(INDIRECT($A$169&$I631)))","v":""}]
["prior_id","prior_id","text",null,null,null,null,null,null,{"$f":"IF(sl_light_key[[#This Row],[Factor]]=\"\",\"\",COLUMN(INDIRECT($A$169&$I632)))","v":""}]
["ru_life","ru_life","text",null,null,null,null,null,null,{"$f":"IF(sl_light_key[[#This Row],[Factor]]=\"\",\"\",COLUMN(INDIRECT($A$169&$I633)))","v":""}]
["rul_reset","rul_reset","text",null,null,null,null,null,null,{"$f":"IF(sl_light_key[[#This Row],[Factor]]=\"\",\"\",COLUMN(INDIRECT($A$169&$I634)))","v":""}]
["condition_wt","condition_wt","text",null,null,null,null,null,null,{"$f":"IF(sl_light_key[[#This Row],[Factor]]=\"\",\"\",COLUMN(INDIRECT($A$169&$I635)))","v":""}]
["condition","condition","text",null,null,null,null,null,null,{"$f":"IF(sl_light_key[[#This Row],[Factor]]=\"\",\"\",COLUMN(INDIRECT($A$169&$I636)))","v":""}]
["condition_date","condition_date","text",null,null,null,null,null,null,{"$f":"IF(sl_light_key[[#This Row],[Factor]]=\"\",\"\",COLUMN(INDIRECT($A$169&$I637)))","v":""}]
["likelihood_wt","likelihood_wt","text",null,null,null,null,null,null,{"$f":"IF(sl_light_key[[#This Row],[Factor]]=\"\",\"\",COLUMN(INDIRECT($A$169&$I638)))","v":""}]
["risk_likelihood","risk_likelihood","text",null,null,null,null,null,null,{"$f":"IF(sl_light_key[[#This Row],[Factor]]=\"\",\"\",COLUMN(INDIRECT($A$169&$I639)))","v":""}]
["consequence_wt","consequence_wt","text",null,null,null,null,null,null,{"$f":"IF(sl_light_key[[#This Row],[Factor]]=\"\",\"\",COLUMN(INDIRECT($A$169&$I640)))","v":""}]
["risk_consequence","risk_consequence","text",null,null,null,null,null,null,{"$f":"IF(sl_light_key[[#This Row],[Factor]]=\"\",\"\",COLUMN(INDIRECT($A$169&$I641)))","v":""}]
["risk","risk","text",null,null,null,null,null,null,{"$f":"IF(sl_light_key[[#This Row],[Factor]]=\"\",\"\",COLUMN(INDIRECT($A$169&$I642)))","v":""}]
["risk_date","risk_date","text",null,null,null,null,null,null,{"$f":"IF(sl_light_key[[#This Row],[Factor]]=\"\",\"\",COLUMN(INDIRECT($A$169&$I643)))","v":""}]
["standard_rc","standard_rc","text",null,null,null,null,null,null,{"$f":"IF(sl_light_key[[#This Row],[Factor]]=\"\",\"\",COLUMN(INDIRECT($A$169&$I644)))","v":""}]
["use_default_rc","use_default_rc","text",null,null,null,null,null,null,{"$f":"IF(sl_light_key[[#This Row],[Factor]]=\"\",\"\",COLUMN(INDIRECT($A$169&$I645)))","v":""}]
["rc_value","rc_value","text",null,null,null,null,null,null,{"$f":"IF(sl_light_key[[#This Row],[Factor]]=\"\",\"\",COLUMN(INDIRECT($A$169&$I646)))","v":""}]
["drc_value","drc_value","text",null,null,null,null,null,null,{"$f":"IF(sl_light_key[[#This Row],[Factor]]=\"\",\"\",COLUMN(INDIRECT($A$169&$I647)))","v":""}]
["annual_drc_value","annual_drc_value","text",null,null,null,null,null,null,{"$f":"IF(sl_light_key[[#This Row],[Factor]]=\"\",\"\",COLUMN(INDIRECT($A$169&$I648)))","v":""}]
["valuation_date","valuation_date","text",null,null,null,null,null,null,{"$f":"IF(sl_light_key[[#This Row],[Factor]]=\"\",\"\",COLUMN(INDIRECT($A$169&$I649)))","v":""}]
["as_tip_note","as_tip_note","text",null,null,null,null,null,null,{"$f":"IF(sl_light_key[[#This Row],[Factor]]=\"\",\"\",COLUMN(INDIRECT($A$169&$I650)))","v":""}]
["added_on","added_on","text",null,null,null,null,null,null,{"$f":"IF(sl_light_key[[#This Row],[Factor]]=\"\",\"\",COLUMN(INDIRECT($A$169&$I651)))","v":""}]
["added_by","added_by","text",null,null,null,null,null,null,{"$f":"IF(sl_light_key[[#This Row],[Factor]]=\"\",\"\",COLUMN(INDIRECT($A$169&$I652)))","v":""}]
["chgd_on","chgd_on","text",null,null,null,null,null,null,{"$f":"IF(sl_light_key[[#This Row],[Factor]]=\"\",\"\",COLUMN(INDIRECT($A$169&$I653)))","v":""}]
["chgd_by","chgd_by","text",null,null,null,null,null,null,{"$f":"IF(sl_light_key[[#This Row],[Factor]]=\"\",\"\",COLUMN(INDIRECT($A$169&$I654)))","v":""}]
["SL_Pole"]
["Column Name","RAMM field name","Data Type","Lookup Table","Column1","Required by Software","Generated Value","Required by NZTA","Factor","Factor Address","Condition","Column2","Field Description","Allowable Values","Data Collection Notes","Database Management Guidance Notes"]
["Road ID","road_id","number",null,null,"Y",null,"Mandatory",null,{"$f":"IF(sl_pole_key[[#This Row],[Factor]]=\"\",\"\",COLUMN(INDIRECT($A$169&$I657)))","v":""}]
["Location","location","number",null,null,null,null,"Mandatory",null,{"$f":"IF(sl_pole_key[[#This Row],[Factor]]=\"\",\"\",COLUMN(INDIRECT($A$169&$I658)))","v":""}]
["Offset (Kerb)","offset_kerb","number",null,null,null,null,"Mandatory",null,{"$f":"IF(sl_pole_key[[#This Row],[Factor]]=\"\",\"\",COLUMN(INDIRECT($A$169&$I659)))","v":""}]
["Offset","offset","number",null,null,null,null,"Mandatory",null,{"$f":"IF(sl_pole_key[[#This Row],[Factor]]=\"\",\"\",COLUMN(INDIRECT($A$169&$I660)))","v":""}]
["Offset (LHS)","offset_lhs","number",null,null,null,null,"Mandatory",null,{"$f":"IF(sl_pole_key[[#This Row],[Factor]]=\"\",\"\",COLUMN(INDIRECT($A$169&$I661)))","v":""}]
["Pole Material","pole_material","text",null,null,null,null,"Mandatory",null,{"$f":"IF(sl_pole_key[[#This Row],[Factor]]=\"\",\"\",COLUMN(INDIRECT($A$169&$I662)))","v":""}]
["Shape","pole_shape","text",null,null,null,null,"Mandatory",null,{"$f":"IF(sl_pole_key[[#This Row],[Factor]]=\"\",\"\",COLUMN(INDIRECT($A$169&$I663)))","v":""}]
["Manufacturer","pole_make","text",null,null,null,null,"Mandatory",null,{"$f":"IF(sl_pole_key[[#This Row],[Factor]]=\"\",\"\",COLUMN(INDIRECT($A$169&$I664)))","v":""}]
["Mount","pole_mount","text",null,null,null,null,"Mandatory",null,{"$f":"IF(sl_pole_key[[#This Row],[Factor]]=\"\",\"\",COLUMN(INDIRECT($A$169&$I665)))","v":""}]
["Attachment","pole_attach","text",null,null,null,null,"Mandatory",null,{"$f":"IF(sl_pole_key[[#This Row],[Factor]]=\"\",\"\",COLUMN(INDIRECT($A$169&$I666)))","v":""}]
["Purpose","pole_purpose","text",null,null,null,null,"Mandatory",null,{"$f":"IF(sl_pole_key[[#This Row],[Factor]]=\"\",\"\",COLUMN(INDIRECT($A$169&$I667)))","v":""}]
["Owner","owner",null,null,null,null,null,"Mandatory",null,{"$f":"IF(sl_pole_key[[#This Row],[Factor]]=\"\",\"\",COLUMN(INDIRECT($A$169&$I668)))","v":""}]
["Coating","coating",null,null,null,null,null,"Mandatory",null,{"$f":"IF(sl_pole_key[[#This Row],[Factor]]=\"\",\"\",COLUMN(INDIRECT($A$169&$I669)))","v":""}]
["Colour","pole_colour","text",null,null,null,null,"Mandatory",null,{"$f":"IF(sl_pole_key[[#This Row],[Factor]]=\"\",\"\",COLUMN(INDIRECT($A$169&$I670)))","v":""}]
["Install Date","intall_date",null,null,null,null,null,"Mandatory",null,{"$f":"IF(sl_pole_key[[#This Row],[Factor]]=\"\",\"\",COLUMN(INDIRECT($A$169&$I671)))","v":""}]
["RUL reset","rul_reset","lookup","rul_reset",null,null,null,"Mandatory",null,{"$f":"IF(sl_pole_key[[#This Row],[Factor]]=\"\",\"\",COLUMN(INDIRECT($A$169&$I672)))","v":""}]
["Condition","condition","lookup","condition",null,null,null,"Mandatory",null,{"$f":"IF(sl_pole_key[[#This Row],[Factor]]=\"\",\"\",COLUMN(INDIRECT($A$169&$I673)))","v":""}]
["Risk Likelihood","risk_likelihood","lookup","likelihood",null,null,null,"Mandatory",null,{"$f":"IF(sl_pole_key[[#This Row],[Factor]]=\"\",\"\",COLUMN(INDIRECT($A$169&$I674)))","v":""}]
["Risk Consequence","risk_consequence","lookup","consequence",null,null,null,"Mandatory",null,{"$f":"IF(sl_pole_key[[#This Row],[Factor]]=\"\",\"\",COLUMN(INDIRECT($A$169&$I675)))","v":""}]
["Failure Risk","risk","lookup","risk",null,null,null,"Mandatory",null,{"$f":"IF(sl_pole_key[[#This Row],[Factor]]=\"\",\"\",COLUMN(INDIRECT($A$169&$I676)))","v":""}]
["Notes","notes","text",null,null,null,null,null,null,{"$f":"IF(sl_pole_key[[#This Row],[Factor]]=\"\",\"\",COLUMN(INDIRECT($A$169&$I677)))","v":""}]

{"sheet":"Bridges","index":6,"n_rows":3,"n_cols":30,"rows_kept":3,"cut":false,"hidden":false,"merged":[]}
[]
["Tag","Road ID","Road Name","Asset Status","Asset ID","Location Description","Bridge Number","Bridge Name","Owner","Culvert","Urban or Rural","Start","End","Length","Rail to Rail","Kerb to Kerb","Constructed Date","Lanes","Traffic Direction","Bridge Type","SH Bridge Function","Combined Function","Start Slab Present","End Slab Present","Curvature Type","RUL reset","Condition","Risk Likelihood","Risk Consequence","Failure Risk"]
[null,{"$f":"IFERROR(IF(bridges[[#This Row],[Road Name]]=\"\",\"\",INDEX(road_name[],MATCH(bridges[[#This Row],[Road Name]],road_name[road_name],0),1)),\"\")","v":""}]

{"sheet":"Traffic_Facilities","index":7,"n_rows":3,"n_cols":6,"rows_kept":3,"cut":false,"hidden":false,"merged":[]}
[]
["Tag","Road ID","Road Name","Asset Status","Asset ID","Location Description"]
[null,{"$f":"IFERROR(IF(traffic_facilities[[#This Row],[Road Name]]=\"\",\"\",INDEX(road_name[],MATCH(traffic_facilities[[#This Row],[Road Name]],road_name[road_name],0),1)),\"\")","v":""}]

{"sheet":"Drainage","index":8,"n_rows":13,"n_cols":32,"rows_kept":13,"cut":false,"hidden":false,"merged":[]}
[]
["Tag","Road ID","Road Name","Asset Status","Asset ID","Location Description","Owner","Drain Type","Location","Construction Date","Culvert Number","Offset","Side","Length","Size","Material","Inlet","Outlet","Culvert Type","Width","Area","Hazard","Waterway","Shape","Fish Passage","Flow Direction","Condition","Risk Likelihood","Risk Consequence","Failure Risk","Default RC?","Notes"]
[null,{"$f":"IFERROR(IF(drainage[[#This Row],[Road Name]]=\"\",\"\",INDEX(road_name[],MATCH(drainage[[#This Row],[Road Name]],road_name[road_name],0),1)),\"\")","v":""},null,null,null,null,null,null,null,null,null,null,null,null,null,null,null,null,null,null,{"$f":"IF(drainage[[#This Row],[Road Name]]=\"\",\"\",drainage[[#This Row],[Width]]*drainage[[#This Row],[Length]])","v":""}]
[null,{"$f":"IFERROR(IF(drainage[[#This Row],[Road Name]]=\"\",\"\",INDEX(road_name[],MATCH(drainage[[#This Row],[Road Name]],road_name[road_name],0),1)),\"\")","v":""},null,null,null,null,null,null,null,null,null,null,null,null,null,null,null,null,null,null,{"$f":"IF(drainage[[#This Row],[Road Name]]=\"\",\"\",drainage[[#This Row],[Width]]*drainage[[#This Row],[Length]])","v":""}]
[null,{"$f":"IFERROR(IF(drainage[[#This Row],[Road Name]]=\"\",\"\",INDEX(road_name[],MATCH(drainage[[#This Row],[Road Name]],road_name[road_name],0),1)),\"\")","v":""},null,null,null,null,null,null,null,null,null,null,null,null,null,null,null,null,null,null,{"$f":"IF(drainage[[#This Row],[Road Name]]=\"\",\"\",drainage[[#This Row],[Width]]*drainage[[#This Row],[Length]])","v":""}]
[null,{"$f":"IFERROR(IF(drainage[[#This Row],[Road Name]]=\"\",\"\",INDEX(road_name[],MATCH(drainage[[#This Row],[Road Name]],road_name[road_name],0),1)),\"\")","v":""},null,null,null,null,null,null,null,null,null,null,null,null,null,null,null,null,null,null,{"$f":"IF(drainage[[#This Row],[Road Name]]=\"\",\"\",drainage[[#This Row],[Width]]*drainage[[#This Row],[Length]])","v":""}]
[null,{"$f":"IFERROR(IF(drainage[[#This Row],[Road Name]]=\"\",\"\",INDEX(road_name[],MATCH(drainage[[#This Row],[Road Name]],road_name[road_name],0),1)),\"\")","v":""},null,null,null,null,null,null,null,null,null,null,null,null,null,null,null,null,null,null,{"$f":"IF(drainage[[#This Row],[Road Name]]=\"\",\"\",drainage[[#This Row],[Width]]*drainage[[#This Row],[Length]])","v":""}]
[null,{"$f":"IFERROR(IF(drainage[[#This Row],[Road Name]]=\"\",\"\",INDEX(road_name[],MATCH(drainage[[#This Row],[Road Name]],road_name[road_name],0),1)),\"\")","v":""},null,null,null,null,null,null,null,null,null,null,null,null,null,null,null,null,null,null,{"$f":"IF(drainage[[#This Row],[Road Name]]=\"\",\"\",drainage[[#This Row],[Width]]*drainage[[#This Row],[Length]])","v":""}]
[null,{"$f":"IFERROR(IF(drainage[[#This Row],[Road Name]]=\"\",\"\",INDEX(road_name[],MATCH(drainage[[#This Row],[Road Name]],road_name[road_name],0),1)),\"\")","v":""},null,null,null,null,null,null,null,null,null,null,null,null,null,null,null,null,null,null,{"$f":"IF(drainage[[#This Row],[Road Name]]=\"\",\"\",drainage[[#This Row],[Width]]*drainage[[#This Row],[Length]])","v":""}]
[null,{"$f":"IFERROR(IF(drainage[[#This Row],[Road Name]]=\"\",\"\",INDEX(road_name[],MATCH(drainage[[#This Row],[Road Name]],road_name[road_name],0),1)),\"\")","v":""},null,null,null,null,null,null,null,null,null,null,null,null,null,null,null,null,null,null,{"$f":"IF(drainage[[#This Row],[Road Name]]=\"\",\"\",drainage[[#This Row],[Width]]*drainage[[#This Row],[Length]])","v":""}]
[null,{"$f":"IFERROR(IF(drainage[[#This Row],[Road Name]]=\"\",\"\",INDEX(road_name[],MATCH(drainage[[#This Row],[Road Name]],road_name[road_name],0),1)),\"\")","v":""},null,null,null,null,null,null,null,null,null,null,null,null,null,null,null,null,null,null,{"$f":"IF(drainage[[#This Row],[Road Name]]=\"\",\"\",drainage[[#This Row],[Width]]*drainage[[#This Row],[Length]])","v":""}]
[null,{"$f":"IFERROR(IF(drainage[[#This Row],[Road Name]]=\"\",\"\",INDEX(road_name[],MATCH(drainage[[#This Row],[Road Name]],road_name[road_name],0),1)),\"\")","v":""},null,null,null,null,null,null,null,null,null,null,null,null,null,null,null,null,null,null,{"$f":"IF(drainage[[#This Row],[Road Name]]=\"\",\"\",drainage[[#This Row],[Width]]*drainage[[#This Row],[Length]])","v":""}]
[null,{"$f":"IFERROR(IF(drainage[[#This Row],[Road Name]]=\"\",\"\",INDEX(road_name[],MATCH(drainage[[#This Row],[Road Name]],road_name[road_name],0),1)),\"\")","v":""}]

{"sheet":"Features","index":9,"n_rows":3,"n_cols":18,"rows_kept":3,"cut":false,"hidden":false,"merged":[]}
[]
["Tag","Road ID","Road Name","Asset Status","Asset ID","Location Description","Owner","Location","Side","Offset","Feature Type","Constructed Date","RUL reset","Condition","Risk Likelihood","Risk Consequence","Cost","Failure Risk"]
[null,{"$f":"IFERROR(IF(features[[#This Row],[Road Name]]=\"\",\"\",INDEX(road_name[],MATCH(features[[#This Row],[Road Name]],road_name[road_name],0),1)),\"\")","v":""}]

{"sheet":"Footpaths","index":10,"n_rows":3,"n_cols":33,"rows_kept":3,"cut":false,"hidden":false,"merged":[]}
[]
["Tag","Road ID","Road Name","Asset Status","Asset ID","Location Description","Owner","Start","Start Description","End","End Description","Side","Offset (Kerb)","Position","Length","Width","Footpath Material","Depth","Chip Size","Binder","Pedestrian Density","Scooter Density","Bicycle Density","Constructed Date","Surface Date","Purpose","Cost","RUL reset","Condition","Risk Likelihood","Risk Consequence","Failure Risk","Notes"]
[null,{"$f":"IFERROR(IF(footpaths[[#This Row],[Road Name]]=\"\",\"\",INDEX(road_name[],MATCH(footpaths[[#This Row],[Road Name]],road_name[road_name],0),1)),\"\")","v":""}]

{"sheet":"Islands","index":11,"n_rows":3,"n_cols":23,"rows_kept":3,"cut":false,"hidden":false,"merged":[]}
[]
["Tag","Road ID","Road Name","Asset Status","Asset ID","Location Description","Owner","Northing","Easting","Type","Constructed Date","Shape","Material","Height","Width","Maintenance Required","Original Cost","RUL reset","Condition","Risk Likelihood","Risk Consequence","Failure Risk","Notes"]
[null,{"$f":"IFERROR(IF(islands[[#This Row],[Road Name]]=\"\",\"\",INDEX(road_name[],MATCH(islands[[#This Row],[Road Name]],road_name[road_name],0),1)),\"\")","v":""}]

{"sheet":"ITS","index":12,"n_rows":3,"n_cols":53,"rows_kept":3,"cut":false,"hidden":false,"merged":[]}
[]
["Tag","Road ID","Road Name","Asset Status","Asset ID","Location Description","Location","Offset","Side","State","State Date","Type","Subtype","ITS Make","Supplier","Support","Owner","Control System","Communications","Matintenance Contract","Maintained By","Purchase Cost","Installation Date","Design Life","Contract Managed By","Site","NMA","Easting","Northing","GPS Date","GPS Organisation","GPS Method","Road Region","Street Address","Field Name","ITS Model","Asset Description","Serial Number","Expected Replacement Year","Construction Contract Number","IP Address","Condition Rating","Condition Rating Date","Defects Start Date","End of Defects Liability Period","Criticality","RUL reset","Condition","Risk Likelihood","Risk Consequence","Failure Risk","Notes","Location General"]
[null,{"$f":"IFERROR(IF(ITS[[#This Row],[Road Name]]=\"\",\"\",INDEX(road_name[],MATCH(ITS[[#This Row],[Road Name]],road_name[road_name],0),1)),\"\")","v":""}]

{"sheet":"Markings","index":13,"n_rows":3,"n_cols":25,"rows_kept":3,"cut":false,"hidden":false,"merged":[]}
[]
["Tag","Road ID","Road Name","Asset Status","Location Description","Owner","Start","End","Length","Quantity","Side","Offset","Type","Colour","Reflectorised?","Material","Install Date","Cost","RUL","Condition","Risk Likelihood","Risk Consequence","Failure Risk","Default RC?","Notes"]
[null,{"$f":"IFERROR(IF(markings[[#This Row],[Road Name]]=\"\",\"\",INDEX(road_name[],MATCH(markings[[#This Row],[Road Name]],road_name[road_name],0),1)),\"\")","v":""},null,null,null,null,null,null,{"$f":"IFERROR(IF(markings[[#This Row],[Road Name]]=\"\",\"\",markings[End]-markings[Start]),\"\")","v":""}]

{"sheet":"Minor_Structures","index":14,"n_rows":3,"n_cols":53,"rows_kept":3,"cut":false,"hidden":false,"merged":[]}
[]
["Tag","Road ID","Road Name","Asset Status","Asset ID","Location Description","Start","Start Description","End","End Description","Type","Subtype","Quantity","Northing","Easting","Northing End","Easting End","GPS Date","GPS Collected By","GPS method","side","Offset (Kerb)","Offset","Offset (LHS)","Offset End (Kerb)","Offset (End)","Offset End (LHS)","Length","Adjustment","Adjustment Reason","Width","Height","Clearance","Area","Material","House Number (start)","House Number (end)","Surface Treatment Code","Colour","Style","Lockable","Artist","Tree Guard","External Number","Constructed Date","RUL reset","Condition","Risk Likelihood","Risk Consequence","Failure Risk","Notes","Owner","Cost"]
[null,{"$f":"IFERROR(IF(minor_structures[[#This Row],[Road Name]]=\"\",\"\",INDEX(road_name[],MATCH(minor_structures[[#This Row],[Road Name]],road_name[road_name],0),1)),\"\")","v":""}]

{"sheet":"Pavement","index":15,"n_rows":6,"n_cols":30,"rows_kept":6,"cut":false,"hidden":false,"merged":[]}
[]
["Tag","Road ID","Road Name","Asset Status","Location Description","Owner","Start","End","Layer or Subgrade?","Layer Date","Offset","Width","Full Width Flag","Data Status","Strength","CBR or UCS?","Subgrade Material","Thickness","Pavement Material","Pavement Source","Recycling","Cost","End User Specification","Reconstructed?","Stabilising Agent Type","Construction Plan No.","Design Life","Design ESA","FWP code","Notes"]
[null,{"$f":"IFERROR(IF(pavement[[#This Row],[Road Name]]=\"\",\"\",INDEX(road_name[],MATCH(pavement[[#This Row],[Road Name]],road_name[road_name],0),1)),\"\")","v":""}]
[null,{"$f":"IFERROR(IF(pavement[[#This Row],[Road Name]]=\"\",\"\",INDEX(road_name[],MATCH(pavement[[#This Row],[Road Name]],road_name[road_name],0),1)),\"\")","v":""}]
[null,{"$f":"IFERROR(IF(pavement[[#This Row],[Road Name]]=\"\",\"\",INDEX(road_name[],MATCH(pavement[[#This Row],[Road Name]],road_name[road_name],0),1)),\"\")","v":""}]
[null,{"$f":"IFERROR(IF(pavement[[#This Row],[Road Name]]=\"\",\"\",INDEX(road_name[],MATCH(pavement[[#This Row],[Road Name]],road_name[road_name],0),1)),\"\")","v":""}]

{"sheet":"Pavement_Test_Pit","index":16,"n_rows":3,"n_cols":16,"rows_kept":3,"cut":false,"hidden":false,"merged":[]}
[]
["Tag","Road ID","Road Name","Asset Status","Asset ID","Location Description","Owner","Layer","Start Depth","End Depth","Material","Subgrade","Layer Strength","CBR or UCS","Stabilising Agent","Notes"]
[null,{"$f":"IFERROR(IF(pavement_test_pit[[#This Row],[Road Name]]=\"\",\"\",INDEX(road_name[],MATCH(pavement_test_pit[[#This Row],[Road Name]],road_name[road_name],0),1)),\"\")","v":""}]

{"sheet":"Railings","index":17,"n_rows":3,"n_cols":32,"rows_kept":3,"cut":false,"hidden":false,"merged":[]}
[]
["Tag","Road ID","Road Name","Asset Status","Asset ID","Location Description","Start","End","Length","Offset","Side","Type","Install Date","Height","Manufacturer","Shape","Material","Attachments","Start Style","End Style","Ground Fix","RUL reset","Condition","Risk Likelihood","Risk Consequence","Failure Risk","Post Condition","Paint System","Default RC?","Owner","Cost","Notes"]
[null,{"$f":"IFERROR(IF(railings[[#This Row],[Road Name]]=\"\",\"\",INDEX(road_name[],MATCH(railings[[#This Row],[Road Name]],road_name[road_name],0),1)),\"\")","v":""},null,null,null,null,null,null,{"$f":"IF(railings[[#This Row],[Road Name]]=\"\",\"\",railings[[#This Row],[End]]-railings[[#This Row],[Start]])","v":""}]

{"sheet":"Retaining_Walls","index":18,"n_rows":3,"n_cols":59,"rows_kept":3,"cut":false,"hidden":false,"merged":[]}
[]
["Tag","Road ID","Road Name","Asset Status","Asset ID","Location Description","Owner","Start","Start Description","End ","End Description","Retaining Wall Type","Quantity","Side","Offset","Calc Length","Length Adjustment","Adjustment Reason","Total Length","Width","Avg Height","Min Height","Max Height","Area","Material","Constructed Date","Cost","Notes","Average Overburden","Min Overburden","Max Overburden","Average Lean Angle","Min Lean Angle","Max Lean Angle","Average Edgeline Offset (Above)","Min Edgeline Offset (Above)","Max Edgeline Offset (Above)","Average Edgeline Offset (Below)","Min Edgeline Offset (Below)","Max Edgeline Offset (Below)","Land Use (Above)","Land Use (Below)","RUL reset","Condition","Risk Likelihood","Risk Consequence","Failure Risk","Northing","Easting","Northing End","Easting End","GPS Date","GPS Organisation","GPS Method","Offset (Kerb)","Offset (LHS)","Offset End (Kerb)","Offset (End)","Offset End (LHS)"]
[null,{"$f":"IFERROR(IF(retaining_walls[[#This Row],[Road Name]]=\"\",\"\",INDEX(road_name[],MATCH(retaining_walls[[#This Row],[Road Name]],road_name[road_name],0),1)),\"\")","v":""}]

{"sheet":"Shoulders","index":19,"n_rows":3,"n_cols":32,"rows_kept":3,"cut":false,"hidden":false,"merged":[]}
[]
["Tag","Road ID","Road Name","Asset Status","Asset ID","Location Description","Owner","Start","End","Side","Offset","Northing","Easting","Northing End","Easting End","GPS Date","GPS Organisation","GPS Method","Length","Length Adjustment","Reason","Width","Material","Last Maintained","Maintenance Cycle","Constructed Date","RUL reset","Condition","Risk Likelihood","Risk Consequence","Failure Risk","Notes"]
[null,{"$f":"IFERROR(IF(shoulders[[#This Row],[Road Name]]=\"\",\"\",INDEX(road_name[],MATCH(shoulders[[#This Row],[Road Name]],road_name[road_name],0),1)),\"\")","v":""}]

{"sheet":"Sign","index":20,"n_rows":3,"n_cols":39,"rows_kept":3,"cut":false,"hidden":false,"merged":[]}
[]
["Tag","Road ID","Road Name","Asset Status","Asset ID","Location Description","Owner","Class","Code","Type","Location","Side","Offset","Legend","Reverse Legend","Legend Material","Legend Colour","Background Material","Background Colour","Width","Height","Substrate","Frame","Install Date","Reason","Replace Date","Replace Reason","RUL","Condition","Risk Likelihood","Risk Consequence","Failure Risk","Default RC?","Number of Posts","Quantity","Road Speed Record Status","Direction","Cost","Notes"]
[null,{"$f":"IFERROR(IF(C3=\"\",\"\",INDEX(road_name[],MATCH(sign[[#This Row],[Road Name]],road_name[road_name],0),1)),\"\")","v":""},null,null,null,null,null,null,{"$f":"IFERROR(IF(J3=\"\",\"\",INDEX(sign_type[],MATCH(J3,sign_type[sign_type],0),1)),\"\")","v":""}]

{"sheet":"SL_Bracket","index":21,"n_rows":3,"n_cols":16,"rows_kept":3,"cut":false,"hidden":false,"merged":[]}
[]
["Tag","Road ID","Road Name","Asset Status","Asset ID","Location Description","Pole ID","Backet Type","Bracket Angle","Bracket Height","Outreach","Coating","Colour","Install Date","Owner","Notes"]
[null,{"$f":"IFERROR(IF(sl_bracket[[#This Row],[Road Name]]=\"\",\"\",INDEX(road_name[],MATCH(sl_bracket[[#This Row],[Road Name]],road_name[road_name],0),1)),\"\")","v":""}]

{"sheet":"SL_Light","index":22,"n_rows":3,"n_cols":82,"rows_kept":3,"cut":false,"hidden":false,"merged":[]}
[]
["Tag","Road ID","Road Name","Asset Status","Asset ID","Location Description","Bracket ID","Light Owner","Light Manufacturer","Model","Light Install Date","Tilt","Supply Point","Colour","Shade","Coating","Gear Manufacturer","Gear Model","Ballast","Ignitor","Capacitor","Gear Install Date","Lamp Manufacturer","Lamp Model","Lamp Install Date","Original Cost","Collect Organisation","Collect Date","Light Notes","Gear Notes","Lamp Notes","light_status","light_supply_point","light_in_reason","light_in_cont_id","light_in_disp_id","light_age","light_replace_date","light_rep_reason","light_rep_cont_id","light_rep_disp_id","gear_status","gear_in_reason","gear_in_cont_id","gear_in_disp_id","gear_age","gear_replace_date","gear_rep_reason","gear_rep_cont_id","gear_rep_disp_id","lamp_in_reason","lamp_in_cont_id","lamp_in_disp_id","lamp_age","lamp_replace_date","lamp_rep_reason","lamp_rep_cont_id","lamp_rep_disp_id","last_cleaned_dt","prior_id","ru_life","rul_reset","condition_wt","condition","condition_date","likelihood_wt","risk_likelihood","consequence_wt","risk_consequence","risk","risk_date","standard_rc","use_default_rc","rc_value","drc_value","annual_drc_value","valuation_date","as_tip_note","added_on","added_by","chgd_on","chgd_by"]
[null,{"$f":"IFERROR(IF(sl_light[[#This Row],[Road Name]]=\"\",\"\",INDEX(road_name[],MATCH(sl_light[[#This Row],[Road Name]],road_name[road_name],0),1)),\"\")","v":""}]

{"sheet":"SL_Pole","index":23,"n_rows":3,"n_cols":26,"rows_kept":3,"cut":false,"hidden":false,"merged":[]}
[]
["Tag","Road ID","Road Name","Asset Status","Asset ID","Location Description","Location","Offset (Kerb)","Offset","Offset (LHS)","Pole Material","Shape","Manufacturer","Mount","Attachment","Purpose","Owner","Coating","Colour","Install Date","RUL reset","Condition","Risk Likelihood","Risk Consequence","Failure Risk","Notes"]
[null,{"$f":"IFERROR(IF(sl_pole[[#This Row],[Road Name]]=\"\",\"\",INDEX(road_name[],MATCH(sl_pole[[#This Row],[Road Name]],road_name[road_name],0),1)),\"\")","v":""}]

{"sheet":"Surfacing","index":24,"n_rows":5,"n_cols":65,"rows_kept":5,"cut":false,"hidden":false,"merged":[]}
[]
["Tag","Road ID","Road Name","Asset Status","Location Description","Owner","Start","End","Length","Offset","Width","Full Width Flag","Calculated Area","Additional Area","Total Sealed Area","Sealed Area Ok?","Depth","Surface Material","Surface Material Type","Surface Date","Removed Date","Lane Coverage","Surface Function","Use Calc Depth","1st Chip Size","2nd Chip Size","Source","Binder Type","Flux Amount","Cutter Amount","Cutter Type","Adhesion Amount","Adhesion Type","Additive Amount","Additive Type","Polymer Type","Polymer Mod %","Torsional Recovery","Softening Point","Residual Rate","Contract Number","Organisation","Specification Type","PSV","ALD","Recycling","Recycling Component Type","Component %","Reason","Work Origin","Life","Cost","Notes","Condition","Default RC?","Northing","Easting","Northing End","Easting End","GPS Collected Date","GPS Collected By","GPS Method","Expected Life","RUL","Activity"]
[null,{"$f":"IFERROR(IF(surfacing[[#This Row],[Road Name]]=\"\",\"\",INDEX(road_name[],MATCH(surfacing[[#This Row],[Road Name]],road_name[road_name],0),1)),\"\")","v":""},null,null,null,null,null,null,{"$f":"IF(surfacing[[#This Row],[Road Name]]=\"\",\"\",surfacing[[#This Row],[End]]-surfacing[[#This Row],[Start]])","v":""},null,null,null,{"$f":"IF(surfacing[[#This Row],[Road Name]]=\"\",\"\",surfacing[[#This Row],[Length]]*surfacing[[#This Row],[Width]])","v":""},null,{"$f":"IF(surfacing[[#This Row],[Road Name]]=\"\",\"\",surfacing[[#This Row],[Calculated Area]]+surfacing[[#This Row],[Additional Area]])","v":""},null,null,null,{"$f":"_xlfn.IFNA(IF(surfacing[Road Name]=\"\",\"\",INDEX(surf_material[],MATCH(surfacing[[#This Row],[Surface Material]],surf_material[surf_material],0),3)),\"\")","v":""},null,null,null,null,{"$f":"IF(surfacing[[#This Row],[Road Name]]=\"\",\"\",_xlfn.IFNA(INDEX(surf_material_type[],MATCH(surfacing[[#This Row],[Surface Material Type]],surf_material_type[Code],0),3),\"\"))","v":""}]
[null,{"$f":"IFERROR(IF(surfacing[[#This Row],[Road Name]]=\"\",\"\",INDEX(road_name[],MATCH(surfacing[[#This Row],[Road Name]],road_name[road_name],0),1)),\"\")","v":""},null,null,null,null,null,null,{"$f":"IF(surfacing[[#This Row],[Road Name]]=\"\",\"\",surfacing[[#This Row],[End]]-surfacing[[#This Row],[Start]])","v":""},null,null,null,{"$f":"IF(surfacing[[#This Row],[Road Name]]=\"\",\"\",surfacing[[#This Row],[Length]]*surfacing[[#This Row],[Width]])","v":""},null,{"$f":"IF(surfacing[[#This Row],[Road Name]]=\"\",\"\",surfacing[[#This Row],[Calculated Area]]+surfacing[[#This Row],[Additional Area]])","v":""},null,null,null,{"$f":"_xlfn.IFNA(IF(surfacing[Road Name]=\"\",\"\",INDEX(surf_material[],MATCH(surfacing[[#This Row],[Surface Material]],surf_material[surf_material],0),3)),\"\")","v":""},null,null,null,null,{"$f":"IF(surfacing[[#This Row],[Road Name]]=\"\",\"\",_xlfn.IFNA(INDEX(surf_material_type[],MATCH(surfacing[[#This Row],[Surface Material Type]],surf_material_type[Code],0),3),\"\"))","v":""}]
[null,{"$f":"IFERROR(IF(surfacing[[#This Row],[Road Name]]=\"\",\"\",INDEX(road_name[],MATCH(surfacing[[#This Row],[Road Name]],road_name[road_name],0),1)),\"\")","v":""},null,null,null,null,null,null,{"$f":"IF(surfacing[[#This Row],[Road Name]]=\"\",\"\",surfacing[[#This Row],[End]]-surfacing[[#This Row],[Start]])","v":""},null,null,null,{"$f":"IF(surfacing[[#This Row],[Road Name]]=\"\",\"\",surfacing[[#This Row],[Length]]*surfacing[[#This Row],[Width]])","v":""},null,{"$f":"IF(surfacing[[#This Row],[Road Name]]=\"\",\"\",surfacing[[#This Row],[Calculated Area]]+surfacing[[#This Row],[Additional Area]])","v":""},null,null,null,{"$f":"_xlfn.IFNA(IF(surfacing[Road Name]=\"\",\"\",INDEX(surf_material[],MATCH(surfacing[[#This Row],[Surface Material]],surf_material[surf_material],0),3)),\"\")","v":""},null,null,null,null,{"$f":"IF(surfacing[[#This Row],[Road Name]]=\"\",\"\",_xlfn.IFNA(INDEX(surf_material_type[],MATCH(surfacing[[#This Row],[Surface Material Type]],surf_material_type[Code],0),3),\"\"))","v":""}]

{"sheet":"SW_Channel","index":25,"n_rows":8,"n_cols":23,"rows_kept":8,"cut":false,"hidden":false,"merged":[]}
[]
["Tag","Road ID","Road Name","Asset Status","Location Description","Start","End","Side","Length","Adjusted Length","Adjust Reason","Offset","Surface Water Channel Type","Construction Date","RUL","Condition","Risk Likelihood","Risk Consequence","Failure Risk","Default RC?","Owner","Cost","Notes"]
[null,{"$f":"IFERROR(IF(sw_channel[[#This Row],[Road Name]]=\"\",\"\",INDEX(road_name[],MATCH(sw_channel[[#This Row],[Road Name]],road_name[road_name],0),1)),\"\")","v":""},null,null,null,null,null,null,{"$f":"IF(sw_channel[[#This Row],[Road Name]]=\"\",\"\",sw_channel[[#This Row],[End]]-sw_channel[[#This Row],[Start]]+sw_channel[[#This Row],[Adjusted Length]])","v":""}]
[null,{"$f":"IFERROR(IF(sw_channel[[#This Row],[Road Name]]=\"\",\"\",INDEX(road_name[],MATCH(sw_channel[[#This Row],[Road Name]],road_name[road_name],0),1)),\"\")","v":""},null,null,null,null,null,null,{"$f":"IF(sw_channel[[#This Row],[Road Name]]=\"\",\"\",sw_channel[[#This Row],[End]]-sw_channel[[#This Row],[Start]]+sw_channel[[#This Row],[Adjusted Length]])","v":""}]
[null,{"$f":"IFERROR(IF(sw_channel[[#This Row],[Road Name]]=\"\",\"\",INDEX(road_name[],MATCH(sw_channel[[#This Row],[Road Name]],road_name[road_name],0),1)),\"\")","v":""},null,null,null,null,null,null,{"$f":"IF(sw_channel[[#This Row],[Road Name]]=\"\",\"\",sw_channel[[#This Row],[End]]-sw_channel[[#This Row],[Start]]+sw_channel[[#This Row],[Adjusted Length]])","v":""}]
[null,{"$f":"IFERROR(IF(sw_channel[[#This Row],[Road Name]]=\"\",\"\",INDEX(road_name[],MATCH(sw_channel[[#This Row],[Road Name]],road_name[road_name],0),1)),\"\")","v":""},null,null,null,null,null,null,{"$f":"IF(sw_channel[[#This Row],[Road Name]]=\"\",\"\",sw_channel[[#This Row],[End]]-sw_channel[[#This Row],[Start]]+sw_channel[[#This Row],[Adjusted Length]])","v":""}]
[null,{"$f":"IFERROR(IF(sw_channel[[#This Row],[Road Name]]=\"\",\"\",INDEX(road_name[],MATCH(sw_channel[[#This Row],[Road Name]],road_name[road_name],0),1)),\"\")","v":""},null,null,null,null,null,null,{"$f":"IF(sw_channel[[#This Row],[Road Name]]=\"\",\"\",sw_channel[[#This Row],[End]]-sw_channel[[#This Row],[Start]]+sw_channel[[#This Row],[Adjusted Length]])","v":""}]
[null,{"$f":"IFERROR(IF(sw_channel[[#This Row],[Road Name]]=\"\",\"\",INDEX(road_name[],MATCH(sw_channel[[#This Row],[Road Name]],road_name[road_name],0),1)),\"\")","v":""},null,null,null,null,null,null,{"$f":"IF(sw_channel[[#This Row],[Road Name]]=\"\",\"\",sw_channel[[#This Row],[End]]-sw_channel[[#This Row],[Start]]+sw_channel[[#This Row],[Adjusted Length]])","v":""}]

{"sheet":"Trees or Gardens","index":26,"n_rows":3,"n_cols":43,"rows_kept":3,"cut":false,"hidden":false,"merged":[]}
[]
["Tag","Road ID","Road Name","Asset Status","Asset ID","Location Description","Owner","Location","Side","Offset (Kerb)","Offset","Offset (LHS)","Tree Position","Dist to Boundary","Dist to Crossing","Dist to SW outlet","Dist to Street Light","Dist to Traffic Light","Dist to Sign","Land Usage","Nearest Feature","Closest House Number","Species","Planting Medium","Medium Description ","Tree Grate","Grove or Species?","Overhead Wires?","Conflicting Wires","Survey Date","Year of Planting","Tree Height","Trunk Diameter","Crown Diameter","% Dead Wood","Crown Attention?","Trunk Attention?","Root Attention?","Pest Attention?","Tree Damage?","Damage to?","Notes","Cost"]
[null,{"$f":"IFERROR(IF(trees[[#This Row],[Road Name]]=\"\",\"\",INDEX(road_name[],MATCH(trees[[#This Row],[Road Name]],road_name[road_name],0),1)),\"\")","v":""}]

{"sheet":"LU General","index":27,"n_rows":84,"n_cols":21,"rows_kept":84,"cut":false,"hidden":false,"merged":[]}
["Contents"]
[null,"tag",null,"asset_status",null,"boolean",null,"boolean",null,"boolean",null,"organisation_code","organisation","gps_by",null,"risk_consequence_code","risk_consequence",null,null,"latest_code","latest"]
[null,"C",null,"New",null,"Yes",null,true,null,"Default",null,"ATR","AARB Transportation Research Ltd","AARB Transportation Research Ltd",null,1,"Insignificant",null,null,"L","Latest"]
[null,"IN",null,"Upgrade",null,"No",null,false,null,"User",null,"MER","Aecom NZ Ltd","Aecom NZ Ltd",null,2,"Minor",null,null,"N","Not Latest"]
[null,null,null,"Removed",null,"Unknown",null,"Unknown",null,"Unknown",null,"ARM","Armitage Systems","Armitage Systems",null,3,"Moderate"]
[null,null,null,null,null,null,null,null,null,null,null,"AUR","Aurecon","Aurecon",null,4,"Major"]
[null,null,null,null,null,null,null,null,null,null,null,"BCF","Beca Infrastructure","Beca Infrastructure",null,5,"Extreme",null,null,"urban_rural_code","urban_rural"]
[null,null,null,null,null,null,null,null,null,null,null,"BL","Beca Ltd.","Beca Ltd.",null,"U","Unknown",null,null,"U","Urban"]
[null,"area",null,"boolean",null,null,null,null,null,null,null,"BLA","Blacktop","Blacktop",null,null,null,null,null,"R","Rural"]
[null,"(NOC) BOP WEST",null,"Estimate",null,null,null,null,null,null,null,"CR&","Combined Road & Traffic Services (Ham)","Combined Road & Traffic Services (Ham)"]
[null,"KAIMAI",null,"Known",null,null,null,null,null,null,null,"CRA","Combined Road and Traffic Services Ltd","Combined Road and Traffic Services Ltd",null,"risk_likelihood_code","risk_likelihood"]
[null,"KATIKATI",null,null,null,null,null,null,null,null,null,"CL","Company-X Ltd.","Company-X Ltd.",null,1,"Rare",null,null,"start_settle_slab_code","start_settle_slab"]
[null,"MAKETU",null,null,null,null,null,null,null,null,null,"CSP","Conspec","Conspec",null,2,"Unlikely",null,null,"P","Present"]
[null,"PRIVATE",null,null,null,null,null,null,null,null,null,"CNL","CoreLogic NZ Ltd.","CoreLogic NZ Ltd.",null,3,"Possible",null,null,"N","Not Present"]
[null,"TE PUKE",null,null,null,null,null,null,null,null,null,"CPB","CPB Contractors","CPB Contractors",null,4,"Likely",null,null,"U","Unknown"]
[null,"WAIHI BEACH",null,null,null,null,null,null,null,null,null,"CRT","CRTS","CRTS",null,5,"Almost Certain"]
[null,null,null,null,null,null,null,null,null,null,null,"DNZ","Downer New Zealand Limited","Downer New Zealand Limited",null,"U","Unknown"]
[null,null,null,null,null,null,null,null,null,null,null,"ECE","Evans Civil Engineering Services","Evans Civil Engineering Services",null,null,null,null,null,"end_settle_slab_code","end_settle_slab"]
[null,null,null,null,null,null,null,null,null,null,null,"VA","Flag to identify Vested Assets","Flag to identify Vested Assets",null,null,null,null,null,"P","Present"]
[null,null,null,null,null,null,null,null,null,null,null,"FH","Fulton Hogan","Fulton Hogan",null,"side_code","side",null,null,"N","Not Present"]
[null,null,null,null,null,null,null,null,null,null,null,"FUL","Fulton Hogan (NZ) Ltd.","Fulton Hogan (NZ) Ltd.",null,"C","Centre",null,null,"U","Unknown"]
[null,null,null,null,null,null,null,null,null,null,null,"GEO","Geosolve Ltd","Geosolve Ltd",null,"L","Left"]
[null,null,null,null,null,null,null,null,null,null,null,"GHD","GHD LTD","GHD LTD",null,"R","Right"]
[null,null,null,null,null,null,null,null,null,null,null,"HEB","HEB Construction Ltd","HEB Construction Ltd",null,"B","Both",null,null,"gps_method_id_code","gps_method_id"]
[null,null,null,null,null,null,null,null,null,null,null,2,"Higgins Contractors BOP","Higgins Contractors BOP",null,"U","Unknown",null,null,1,"Generic GPS Device"]
[null,null,null,null,null,null,null,null,null,null,null,"HIG","Higgins Contractors Ltd.","Higgins Contractors Ltd.",null,null,null,null,null,2,"User clicked on Map"]
[null,null,null,null,null,null,null,null,null,null,null,"HEL","Horizon Energy Ltd.","Horizon Energy Ltd.",null,null,null,null,null,3,"Update RAMM from Map"]
[null,null,null,null,null,null,null,null,null,null,null,"HSL","Horizon Services Ltd","Horizon Services Ltd",null,"condition_code","condition","post_condition",null,4,"Unknown"]
[null,null,null,null,null,null,null,null,null,null,null,"INR","Inroads","Inroads",null,1,"Excellent","Excellent",null,5,"Taken from Asset"]
[null,null,null,null,null,null,null,null,null,null,null,"LA","Local Authority","Local Authority",null,2,"Good","Good",null,6,"Taken from Asset"]
[null,null,null,null,null,null,null,null,null,null,null,"MCB","McBreens","McBreens",null,3,"Average","Average",null,7,"Default"]
[null,null,null,null,null,null,null,null,null,null,null,"MCC","McKays Consultants","McKays Consultants",null,4,"Poor","Poor",null,8,"No GPS lock"]
[null,null,null,null,null,null,null,null,null,null,null,"TNZ","NZ Transport Agency","NZ Transport Agency",null,5,"Very poor","Very poor",null,9,"GPS but no differential correction"]
[null,null,null,null,null,null,null,null,null,null,null,"NTA","NZ Transport Agency - Highway Programme","NZ Transport Agency - Highway Programme",null,"U","Unknown","Unknown",null,10,"GPS with differential correction"]
[null,null,null,null,null,null,null,null,null,null,null,"OI2","Opus International Consultants Ltd (NZ)","Opus International Consultants Ltd (NZ)",null,null,null,null,null,11,"RTK GPS"]
[null,null,null,null,null,null,null,null,null,null,null,"OIC","Opus International Consultants Ltd.","Opus International Consultants Ltd."]
[null,null,null,null,null,null,null,null,null,null,null,"OTH","Other","Other",null,"rul_reset_code","rul_reset"]
[null,null,null,null,null,null,null,null,null,null,null,"CON","Other Contractor","Other Contractor",null,"R","Reset to Zero"]
[null,null,null,null,null,null,null,null,null,null,null,"PP","Parks and Property","Parks and Property",null,"N","Not Reset"]
[null,null,null,null,null,null,null,null,null,null,null,"RSL","RAMM Software Limited","RAMM Software Limited"]
[null,null,null,null,null,null,null,null,null,null,null,"RAF","Read-only access for Tenderers","Read-only access for Tenderers"]
[null,null,null,null,null,null,null,null,null,null,null,"RDC","Rotorua District Council","Rotorua District Council",null,"use_default_rc_code","use_default_rc"]
[null,null,null,null,null,null,null,null,null,null,null,"SAF","Saferoads","Saferoads",null,"D","Default"]
[null,null,null,null,null,null,null,null,null,null,null,"SMK","Spraymarks","Spraymarks",null,"U","User"]
[null,null,null,null,null,null,null,null,null,null,null,"SWP","SWAPS","SWAPS"]
[null,null,null,null,null,null,null,null,null,null,null,"TCC","Tauranga City Council","Tauranga City Council"]
[null,null,null,null,null,null,null,null,null,null,null,"TT","Tonkin and Taylor Ltd","Tonkin and Taylor Ltd",null,"reflectorised_code","reflectorised"]
[null,null,null,null,null,null,null,null,null,null,null,"UKN","Unknown","Unknown",null,"N","Normal"]
[null,null,null,null,null,null,null,null,null,null,null,"WAI","Waiotahi","Waiotahi",null,"R","Reflectorised"]
[null,null,null,null,null,null,null,null,null,null,null,"WBO","Western Bay of Plenty District Council","Western Bay of Plenty District Council"]
[null,null,null,null,null,null,null,null,null,null,null,"WL","WestLink","WestLink",null,"other_side_code","other_side"]
[null,null,null,null,null,null,null,null,null,null,null,"WDC","WestRoads (NZTA / WBOPDC)","WestRoads (NZTA / WBOPDC)",null,"C","Centre"]
[null,null,null,null,null,null,null,null,null,null,null,"WI","Works Infrastructure","Works Infrastructure",null,"L","Left"]
[null,null,null,null,null,null,null,null,null,null,null,"WIC","WSP-Opus International Consultants Ltd","WSP-Opus International Consultants Ltd",null,"R","Right"]
[null,null,null,null,null,null,null,null,null,null,null,null,null,null,null,"B","Both"]
[null,null,null,null,null,null,null,null,null,null,null,null,null,null,null,"U","Unknown"]
[]
[null,null,null,null,null,null,null,null,null,null,null,null,null,null,null,"risk_code","risk"]
[null,null,null,null,null,null,null,null,null,null,null,"asset_owner_code","asset_owner",null,null,1,"Very Low"]
[null,null,null,null,null,null,null,null,null,null,null,"C","Crown",null,null,2,"Low"]
[null,null,null,null,null,null,null,null,null,null,null,"L","Western Bay of Plenty",null,null,3,"Medium"]
[null,null,null,null,null,null,null,null,null,null,null,"M","Maori Roadway",null,null,4,"High"]
[null,null,null,null,null,null,null,null,null,null,null,"P","Private",null,null,5,"Extreme"]
[null,null,null,null,null,null,null,null,null,null,null,"TCC","Tauranga CC",null,null,"U","Unknown"]
[]
[null,null,null,null,null,null,null,null,null,null,null,null,null,null,null,"side_code","side"]
[null,null,null,null,null,null,null,null,null,null,null,"status_code","status",null,null,"C","Centre"]
[null,null,null,null,null,null,null,null,null,null,null,"N","New",null,null,"L","Left"]
[null,null,null,null,null,null,null,null,null,null,null,"R","Reconditioned",null,null,"E","End"]
[null,null,null,null,null,null,null,null,null,null,null,"U","Unknown",null,null,"B","Both"]
[null,null,null,null,null,null,null,null,null,null,null,null,null,null,null,"N","Not Applicable"]
[]
[null,null,null,null,null,null,null,null,null,null,null,null,null,null,null,"offset_side_code","offset_side"]
[null,null,null,null,null,null,null,null,null,null,null,null,null,null,null,"C","Centre"]
[null,null,null,null,null,null,null,null,null,null,null,null,null,null,null,"L","Left"]
[null,null,null,null,null,null,null,null,null,null,null,null,null,null,null,"E","End"]
[null,null,null,null,null,null,null,null,null,null,null,null,null,null,null,"R","Right"]
[null,null,null,null,null,null,null,null,null,null,null,null,null,null,null,"A","Across"]
[]
[null,null,null,null,null,null,null,null,null,null,null,null,null,null,null,"side_code","side"]
[null,null,null,null,null,null,null,null,null,null,null,null,null,null,null,"C","Centre"]
[null,null,null,null,null,null,null,null,null,null,null,null,null,null,null,"L","Left"]
[null,null,null,null,null,null,null,null,null,null,null,null,null,null,null,"R","Right"]
[null,null,null,null,null,null,null,null,null,null,null,null,null,null,null,"U","Unknown"]

{"sheet":"LU Features","index":28,"n_rows":30,"n_cols":3,"rows_kept":30,"cut":false,"hidden":false,"merged":[]}
["Contents"]
[null,"feature_type_code","feature_type"]
[null,"SRVICE","BEWARE of SERVICE"]
[null,"BR","Bridge"]
[null,"CYCLE","Cycle path"]
[null,"DOSLI","DOSLI Benchmark"]
[null,"DRNOTH","Drain not maintained by TNZ"]
[null,"EG","Emergency Gates"]
[null,"EP","Emergency Phone"]
[null,"HMLT","High Mast Light Towers"]
[null,"BUILD","Historic Building"]
[null,"INT","Intersection"]
[null,"INTX","Intersection Cross Roads"]
[null,"INTL","Intersection T - Left"]
[null,"INTR","Intersection T - Right"]
[null,"LOCAL","Local Feature"]
[null,"CALIB","LTPP Calibration site"]
[null,"MAC","Major Access"]
[null,"MON","Monument"]
[null,"RES","NZTA Reseal Test Site"]
[null,"TRAF","Permanent traffic monitoring (site do not use)"]
[null,"PLAQUE","Plaque/Historic Location"]
[null,"XING","Rail Crossing"]
[null,"REST","Rest Area"]
[null,"SIGINT","Signal Controlled Intersection"]
[null,"TREE","Significant Tree"]
[null,"PILE","Stockpile Site"]
[null,"ISLAND","Traffic Island"]
[null,"TRIAL","Trial Site"]
[null,"UNDEFI","Undefined"]

{"sheet":"LU SW_Channel","index":29,"n_rows":19,"n_cols":6,"rows_kept":19,"cut":false,"hidden":false,"merged":[]}
["Contents"]
[null,"swc_type_code","swc_type",null,"len_adjust_rsn_code","len_adjust_rsn"]
[null,"DA","Dished Channel (Asphalt)",null,"AWAY","Ends away from the road"]
[null,"DC","Dished Channel (Concrete)",null,"BYOND","Ends beyond Road End"]
[null,"DP","Dished Channel (Half pipe)",null,"COM","Common Section"]
[null,"DS","Dished Channel (Sealed)",null,"CUL","Cul de sac"]
[null,"KCC","Kerb & Channel (Concrete)",null,"DUMMY","Dummy of No Length"]
[null,"KCS","Kerb & Channel (Stone)",null,"ISECT","Starts or Ends at an Intersection"]
[null,"KDC","Kerb & Dished Channel (Concrete)",null,"NONE","No adjustments made"]
[null,"KF","Kerb Flush",null,"RAB","Roundabout"]
[null,"KC","Kerb Only (Concrete)",null,"SH","State Highway"]
[null,"KS","Kerb Only (Stone)",null,"UKN","Unknown"]
[null,"MKCC","Mountable Kerb & Channel (Concrete)",null,"WIDEN","Widening"]
[null,"MKC","Mountable Kerb Only (Concrete)"]
[null,"OTHER","Other Type"]
[null,"SLTC","Slot Channel (Concrete)"]
[null,"SWCD","SWC (Deep, >200 Below Seal Edge)"]
[null,"SWCS","SWC (Shallow, <200 Below Seal Edge)"]
[null,"UKN","Unknown"]

{"sheet":"LU Bridges","index":30,"n_rows":22,"n_cols":15,"rows_kept":22,"cut":false,"hidden":false,"merged":[]}
["Contents"]
[null,"traffic_direction_code","traffic_direction",null,"bridge_type_code","bridge_type",null,"sh_func_type_code","sh_func_type",null,"comb_func_type_code","comb_func_type",null,"curvature_type_code","curvature_type"]
[null,"T","Two-way",null,"BG","Box Girder",null,"FT","Footbridge over State Highway",null,"NON","None",null,"CCC","Comb. Horizontal and Vertical Crest Curv"]
[null,"I","Increasing",null,"CBS","Comp Beam and Slab",null,"OTH","Other",null,"OTH","Other",null,"CSC","Comb. Horizontal and Vertical Sag Curve"]
[null,"D","Decreasing",null,"CU","Stock Underpass",null,"RDO","Road over State Highway",null,"RCY","Road and Separate Cycleway",null,"HC","Horizontal Curve"]
[null,null,null,null,"CUL","Culvert",null,"RLO","Railway over State Highway",null,"RFT","Road and Footway",null,"MHC","Multiple Horizontal Curves"]
[null,null,null,null,"DA","Deck Arch",null,"RMP","On/Off Ramp to/from State Highway",null,"RRD","Road and Rail, Separate Lane",null,"MVC","Multiple Vertical Curves"]
[null,null,null,null,"DT","Deck Truss",null,"SHC","State Highway over combination",null,"RRS","Road and Rail, Same Lane",null,"OTH","Other"]
[null,null,null,null,"MA","Masonary Arch",null,"SRD","State Highway over Road",null,"UKN","Unknown",null,"STR","Straight"]
[null,null,null,null,"NBS","Non Comp Beam & Slab",null,"SRL","State Highway over Railway",null,null,null,null,"UKN","Unknown"]
[null,null,null,null,"OTH","Other",null,"SSB","Road Over Stock Under Pass",null,null,null,null,"VCC","Vertical Crest Curve"]
[null,null,null,null,"PF","Portal frame",null,"SST","State Highway over Stream",null,null,null,null,"VSC","Vertical Sag Curve"]
[null,null,null,null,"PU","Precast Units Only",null,"UKN","Unknown"]
[null,null,null,null,"PUS","Precast Units - Slab"]
[null,null,null,null,"SBCD","Steel Beam Concrete Deck"]
[null,null,null,null,"SLB","Slab"]
[null,null,null,null,"SUS","Suspension"]
[null,null,null,null,"TA","Through Arch"]
[null,null,null,null,"TIM","Timber"]
[null,null,null,null,"TMA","Twin Masonary Arch"]
[null,null,null,null,"TT","Through Truss"]
[null,null,null,null,"UKN","Unknown"]

{"sheet":"LU Pavement","index":31,"n_rows":95,"n_cols":17,"rows_kept":95,"cut":false,"hidden":false,"merged":[]}
["Contents"]
[null,"pave_source_code","pave_source",null,"layer_subgrade_code","layer_subgrade",null,"pave_material_code","pave_material",null,"pave_subgrade",null,"pave_spec_code","pave_spec",null,"fw_treatment_code","fw_treatment"]
[null,"AV DEFAULT","AV DEFAULT",null,"L","Pavement Layer",null,"AGG","Aggregate",null,"ASH",null,"PAST","No specification - layer laid prior to specifications",null,"AC","Asphaltic Concrete"]
[null,"AWAKERI","Awakeri Quarry",null,"S","Subgrade",null,"AP100","All passing 100mm sieve",null,"BEDROCK",null,"B5","Performance Spec - In-situ Stabilisation of Modified Pavement Layers",null,"AWT","Area Wide Pavement Treatment"]
[null,"BALDWINS","Baldwins Quarry",null,null,null,null,"AP150","All passing 150mm sieve",null,"BOULDERS",null,"B3","Performance Spec - Unbound Granular Pavements",null,"CAPE","Capeseal"]
[null,"EXPOSED EXISTING","Exposed Existing",null,null,null,null,"AP20","All passing 20MM sieve",null,"CLAY",null,"M10","Specification for dense graded and stone mastic asphalt",null,"CS","Crack seal - all chip grades"]
[null,"GLENBROOK","Glenbrook Steel Mill",null,null,null,null,"AP40","All passing 40MM sieve",null,"GRAVEL",null,"TNZ/M4","TNZ/M4",null,"DI","Drainage Improvement"]
[null,"HYNDMANS","Hyndman Quarry",null,null,null,null,"AP50","All passing 50mm sieve",null,"ORGANIC",null,"B2","Unbound Granular Pavements",null,"DM","Drainage maintenance (restore"]
[null,"KATIKATI","KATIKATI",null,"cbr_ucs_code","cbr_ucs",null,"AP65","All passing 65MM sieve",null,"PUMICE",null,null,null,null,"DOSOME","Do Something"]
[null,"LEACHS","LEACHS",null,"C","CBR",null,"AP75","All passing 75mm sieve",null,"ROCK",null,null,null,null,"DRAIN","Drainage maintenance (generic)"]
[null,"MAKETU","MAKETU",null,"U","UCS",null,"AP7","All passing 7mm sieve",null,"SAND",null,null,null,null,"FS","Fabric Seal"]
[null,"MATAMATA","MATAMATA",null,null,null,null,"BOLDER","Boulders - Uncrushed Random",null,"SILT",null,null,null,null,"MILL","Milling and removal (eg rounda"]
[null,"OROPI","Oropi Quarry",null,null,null,null,"BRIDGE","BRIDGE DECK",null,"UNKNOWN",null,null,null,null,"MLAY","Maintenance Overlay"]
[null,"POPLAR LANE","POPLAR LANE",null,null,null,null,"EME2","Class 2 High Modulus Asphalt",null,"CLAY - CH",null,null,null,null,"OGPA","Open Graded Porous Asphalt"]
[null,"RECYCLED EXISTING","Recycled Existing",null,"reconstructed_code","reconstructed",null,"COMP","Composite of different recycle",null,"CLAY - CL",null,null,null,null,"OLAY","Overlay"]
[null,"REIDS ROAD","Reids Road Quarry",null,"R","Reconstructed",null,"CR","Crusher Run",null,"GRAVEL - GC",null,null,null,null,"OLAYD",">100mm Granular Overlay"]
[null,"SWAPS","SWAPS",null,"U","Undisturbed",null,"ACM10","Dense graded asphalt AC10 (M/10)",null,"GRAVEL - GM",null,null,null,null,"OLAYS","<100mm Granualar Overlay"]
[null,"TAOTAOROA","Taotaoroa",null,null,null,null,"ACM14","Dense graded asphalt AC14 (M/10)",null,"GRAVEL - GP",null,null,null,null,"PROJ","Development Project (eg realig"]
[null,"TGA METAL","TGA METAL",null,null,null,null,"ACM20","Dense graded asphalt AC20 (M/10)",null,"GRAVEL - GW",null,null,null,null,"RECY","Recycling (cold milling)"]
[null,"TIROHIA","TIROHIA",null,null,null,null,"ACM28","Dense graded asphalt AC28 (M/10)",null,"ORGANIC - OH",null,null,null,null,"RHAB","Rehabilitation"]
[null,"UNKNOWN","UNKNOWN",null,null,null,null,"DG10","Dense graded asphalt DG10 (M/10)",null,"ORGANIC - OL",null,null,null,null,"RJVN","Rejuvenation Seal"]
[null,"WAIOEKA","Waioeka River",null,null,null,null,"DG14","Dense graded asphalt DG14 (M/10)",null,"PEAT",null,null,null,null,"RMUP","Recycling (milling) with make"]
[null,"WAITAWHETA","WAITAWHETA",null,null,null,null,"DG20","Dense graded asphalt DG20 (M/10)",null,"PUMICE/ASH",null,null,null,null,"RMUPD",">100mm  Recycling with Make Up Material"]
[null,"WHITEHALL","Whitehall Quarry",null,null,null,null,"DG28","Dense graded asphalt DG28 (M/10)",null,"SAND - SC",null,null,null,null,"RMUPS","<100mm  Recycling with Make Up M"]
[null,"WINSTONE","WINSTONE",null,null,null,null,"ETB","Emulsion Treated Basecourse",null,"SAND - SM",null,null,null,null,"RS","Reseal (chip unknown)"]
[null,null,null,null,null,null,null,"EXIST","Existing Pavement",null,"SAND - SP",null,null,null,null,"RS2","Reseal - single chip, grade 2"]
[null,null,null,null,null,null,null,"FABRIC","Fabric",null,"SAND - SW",null,null,null,null,"RS24","Reseal - racked in 24, two chi"]
[null,null,null,null,null,null,null,"FILTER","Filter cloth",null,"SILT - MH",null,null,null,null,"RS24C","Resurfacing - Combination 4 and 2"]
[null,null,null,null,null,null,null,"FBS","Foam Bitumen Stabilised",null,"SILT - ML",null,null,null,null,"RS24R","Resurfacing - Racked in 4 on 2"]
[null,null,null,null,null,null,null,"GAP100","Graded all passing 100mm sieve",null,"VOLCANIC",null,null,null,null,"RS24S","Resurfacing - Sandwich 4 on 2"]
[null,null,null,null,null,null,null,"GAP150","Graded all passing 150mm sieve",null,null,null,null,null,null,"RS24W","Resurfacing - Wetlock 4 on 2"]
[null,null,null,null,null,null,null,"GAP20","Graded all passing 20mm sieve",null,null,null,null,null,null,"RS25","Resurfacing - Chipsizes 2 and 5"]
[null,null,null,null,null,null,null,"GAP40","Graded all passing 40mm sieve",null,null,null,null,null,null,"RS25C","Resurfacing - Combination 2 and 5"]
[null,null,null,null,null,null,null,"GAP65","Graded all passing 65mm sieve",null,null,null,null,null,null,"RS25R","Resurfacing - Racked in 5 on 2"]
[null,null,null,null,null,null,null,"GAP7","Graded all passing 7mm sieve",null,null,null,null,null,null,"RS25S","Resurfacing - Sandwich 5 on 2"]
[null,null,null,null,null,null,null,"FILL","Granular fill",null,null,null,null,null,null,"RS25W","Resurfacing - Wetlock 5 on 2"]
[null,null,null,null,null,null,null,"HFAC10","High Fatigue Dense Graded Asphalt AC10 (M/10)",null,null,null,null,null,null,"RS26","Resurfacing - Chipsizes 2 and 6"]
[null,null,null,null,null,null,null,"HFAC14","High Fatigue Dense Graded Asphalt AC14 (M/10)",null,null,null,null,null,null,"RS26C","Resurfacing - Combination 2 and 6"]
[null,null,null,null,null,null,null,"HFAC20","High Fatigue Dense Graded Asphalt AC20 (M/10)",null,null,null,null,null,null,"RS26R","Resurfacing - Racked in 6 on 2"]
[null,null,null,null,null,null,null,"HFAC28","High Fatigue Dense Graded Asphalt AC28 (M/10)",null,null,null,null,null,null,"RS26S","Resurfacing - Sandwich 6 on 2"]
[null,null,null,null,null,null,null,"HLAB40","Hi-Lab all passing 40mm sieve",null,null,null,null,null,null,"RS26W","Resurfacing - Wetlock 6 on 2"]
[null,null,null,null,null,null,null,"HLAB50","Hi-Lab all passing 50mm sieve",null,null,null,null,null,null,"RS3","Reseal - single chip, grade 3"]
[null,null,null,null,null,null,null,"HLAB65","Hi-Lab all passing 65mm sieve",null,null,null,null,null,null,"RS35","Reseal - racked in 35, two chi"]
[null,null,null,null,null,null,null,"LIME","Lime Rock",null,null,null,null,null,null,"RS35C","Resurfacing - Combination 3 and 5"]
[null,null,null,null,null,null,null,"AP40LF","M/4 Spec AP 40 - Low Fines",null,null,null,null,null,null,"RS35R","Resurfacing - Racked in 5 on 3"]
[null,null,null,null,null,null,null,"M4AP20","M/4 Spec. All passing 20mm",null,null,null,null,null,null,"RS35S","Resurfacing - Sandwich 5 on 3"]
[null,null,null,null,null,null,null,"M4AP40","M/4 Spec. All passing 40mm",null,null,null,null,null,null,"RS35W","Resurfacing - Wetlock 5 on 3"]
[null,null,null,null,null,null,null,"M5AP40","M/5 Spec. AP40",null,null,null,null,null,null,"RS36","Reseal - chip sizes 3 and 6"]
[null,null,null,null,null,null,null,"M5GIS1","M/5 Spec. Gisborne 1",null,null,null,null,null,null,"RS36C","Resurfacing - Combination 6 and 3"]
[null,null,null,null,null,null,null,"M5GIS2","M/5 Spec. Gisborne 2",null,null,null,null,null,null,"RS36R","Resurfacing - Racked in 6 on 3"]
[null,null,null,null,null,null,null,"M5ROT1","M/5 Spec. Rotorua 1",null,null,null,null,null,null,"RS36S","Resurfacing - Sandwich Seal 6 on 3"]
[null,null,null,null,null,null,null,"M3","M3 Specification",null,null,null,null,null,null,"RS36W","Resurfacing - Wetlock 6 on 3"]
[null,null,null,null,null,null,null,"M4","M4 Specification",null,null,null,null,null,null,"RS4","Reseal - single chip, grade 4"]
[null,null,null,null,null,null,null,"PM146","OGEM MIX 5 O/L",null,null,null,null,null,null,"RS42","Reseal Grade 4 then 2"]
[null,null,null,null,null,null,null,"CONC","Old Concrete surface",null,null,null,null,null,null,"RS46","Reseal - racked in 46, two chip"]
[null,null,null,null,null,null,null,"SEALS","Old seals",null,null,null,null,null,null,"RS46R","Resurfacing - Racked in 6 on 4"]
[null,null,null,null,null,null,null,"PM148","PEACOCKS WHAP",null,null,null,null,null,null,"RS46S","Resurfacing - Sandwich 6 on 4"]
[null,null,null,null,null,null,null,"PR","Pit Run",null,null,null,null,null,null,"RS46W","Resurfacing - Wetlock 6 on 4"]
[null,null,null,null,null,null,null,"PM155","PREMIX",null,null,null,null,null,null,"RS5","Reseal - single chip, grade 5"]
[null,null,null,null,null,null,null,"STRIP","Quarry Strippings - Ungraded",null,null,null,null,null,null,"RS52","Reseal Grade 5 then 2"]
[null,null,null,null,null,null,null,"RR","River Run",null,null,null,null,null,null,"RS53","Reseal Grade 5 then 3"]
[null,null,null,null,null,null,null,"ROCK","Rock",null,null,null,null,null,null,"RS6","Reseal - Chip size 6"]
[null,null,null,null,null,null,null,"ROT","Rotten Rock",null,null,null,null,null,null,"RSB","Resurfacing - Big Chip"]
[null,null,null,null,null,null,null,"ROP500","Run of Pit - Graded Max 500mm",null,null,null,null,null,null,"RSM","Resurfacing - Multiple Chip"]
[null,null,null,null,null,null,null,"ROR300","Run of River - Graded Max 300",null,null,null,null,null,null,"RSS","Resurfacing - Small Chip"]
[null,null,null,null,null,null,null,"ROR500","Run of River - Graded Max 500",null,null,null,null,null,null,"RSU","Resurfacing - Unknown Chip"]
[null,null,null,null,null,null,null,"SAND","Sand Filter/Drainage Layer",null,null,null,null,null,null,"SAC","Structural Asphaltic Concrete"]
[null,null,null,null,null,null,null,"SAP100","Scoria all passing 100mm sieve",null,null,null,null,null,null,"SC2","Second Coat Seals, grade 2"]
[null,null,null,null,null,null,null,"SAP150","Scoria all passing 150mm sieve",null,null,null,null,null,null,"SC3","Second Coat Seals, grade 3"]
[null,null,null,null,null,null,null,"SAP20","Scoria all passing 20MM Sieve",null,null,null,null,null,null,"SC4","Second Coat Seals, grade 4"]
[null,null,null,null,null,null,null,"SAP40","Scoria all passing 40mm sieve",null,null,null,null,null,null,"SC5","Second Coat Seals, grade 5"]
[null,null,null,null,null,null,null,"SAP65","Scoria all passing 65mm sieve",null,null,null,null,null,null,"SCAC","Shape correction asphaltic con"]
[null,null,null,null,null,null,null,"SAP7","Scoria all passing 7mm sieve",null,null,null,null,null,null,"SE","Seal Extension"]
[null,null,null,null,null,null,null,"SHELL","SHELL",null,null,null,null,null,null,"SG","Shoulder grading (remove turf"]
[null,null,null,null,null,null,null,"SUB30","SUBBASE CBR>30",null,null,null,null,null,null,"SLRY","Slurry Seal"]
[null,null,null,null,null,null,null,"SUB40","SUBBASE CBR>40",null,null,null,null,null,null,"SMOO","Smoothing"]
[null,null,null,null,null,null,null,"NRB B2","Subbase NRB B/2 Spec.",null,null,null,null,null,null,"SR","Shoulder Rutting Incl. Seal"]
[null,null,null,null,null,null,null,"SUBBAS","SUBBASE SE>40",null,null,null,null,null,null,"SS24","Sandwich Seal"]
[null,null,null,null,null,null,null,"TNZ M4","TNZ M4 AP40",null,null,null,null,null,null,"SS35","Sandwich Seal"]
[null,null,null,null,null,null,null,"T/C","Topcourse",null,null,null,null,null,null,"STAB","Stabilisation (lime and/or cem"]
[null,null,null,null,null,null,null,"PM01","UNKNOWN CBR>10",null,null,null,null,null,null,"STAC","Structural Asphaltic Concretye"]
[null,null,null,null,null,null,null,"PM02","UNKNOWN CBR>15",null,null,null,null,null,null,"SW","Seal widening"]
[null,null,null,null,null,null,null,"PM03","UNKNOWN CBR>20",null,null,null,null,null,null,"TAC","Thin asphaltic concrete"]
[null,null,null,null,null,null,null,"PM04","UNKNOWN CBR>23",null,null,null,null,null,null,"TEXT","Texturising Seal"]
[null,null,null,null,null,null,null,"PM05","UNKNOWN CBR>25",null,null,null,null,null,null,"UMS","Unsealed Metal Srengthening"]
[null,null,null,null,null,null,null,"PM06","UNKNOWN CBR>30",null,null,null,null,null,null,"USH","Unsealed Pavement Shaping"]
[null,null,null,null,null,null,null,"UNKNOW","Unknown material (Old record)",null,null,null,null,null,null,"UT_SEWR","Utilities Sewerage Upgrade"]
[null,null,null,null,null,null,null,"WHAP20","Works Hamilton Graded AP20",null,null,null,null,null,null,"UT_STMW","Utilities Stormwater"]
[null,null,null,null,null,null,null,"WHAP40","Works Hamilton Graded AP40",null,null,null,null,null,null,"UT_WATR","Utilities Water Main Upgrade"]
[null,null,null,null,null,null,null,"WHAP65","Works Hamilton Graded AP65",null,null,null,null,null,null,"UW","Unsealed Widening"]
[null,null,null,null,null,null,null,null,null,null,null,null,null,null,null,"UWC","Unsealed Wearing Course"]
[null,null,null,null,null,null,null,null,null,null,null,null,null,null,null,"VF","Void Filling"]
[null,null,null,null,null,null,null,null,null,null,null,null,null,null,null,"WB","Water Blasting"]
[null,null,null,null,null,null,null,null,null,null,null,null,null,null,null,"WCUT","Water Cutting"]
[null,null,null,null,null,null,null,null,null,null,null,null,null,null,null,"WRUT","Area wide wheel track rutting"]

{"sheet":"LU Markings","index":32,"n_rows":109,"n_cols":10,"rows_kept":109,"cut":false,"hidden":false,"merged":[]}
["Contents"]
[null,"marking_type_code","marking_type_desc","marking_type",null,"marking_colour_code","marking_colour",null,"marking_material_code","marking_material"]
[null,"M01","Centreline 100mm continuous",{"$f":"_xlfn.CONCAT(marking_type[[#This Row],[marking_type_code]]&\" - \"&marking_type[[#This Row],[marking_type_desc]])","v":"M01 - Centreline 100mm continuous"},null,"BK","Blacking out paint",null,"CP","Cold Applied Plastic"]
[null,"M01A","Centreline 150mm continuous",{"$f":"_xlfn.CONCAT(marking_type[[#This Row],[marking_type_code]]&\" - \"&marking_type[[#This Row],[marking_type_desc]])","v":"M01A - Centreline 150mm continuous"},null,"BU","Blue",null,"EP","Epoxy resin (for coloured surfacings)"]
[null,"M02","Centreline 100mm 3 x 7",{"$f":"_xlfn.CONCAT(marking_type[[#This Row],[marking_type_code]]&\" - \"&marking_type[[#This Row],[marking_type_desc]])","v":"M02 - Centreline 100mm 3 x 7"},null,"RE","Red",null,"PR","High intensity prismatic"]
[null,"M02A","Centreline 150mm 3 x 7",{"$f":"_xlfn.CONCAT(marking_type[[#This Row],[marking_type_code]]&\" - \"&marking_type[[#This Row],[marking_type_desc]])","v":"M02A - Centreline 150mm 3 x 7"},null,"UN","Unknown",null,"PM","Raised Pavement Marker"]
[null,"M02B","Centreline 200mm 3x7",{"$f":"_xlfn.CONCAT(marking_type[[#This Row],[marking_type_code]]&\" - \"&marking_type[[#This Row],[marking_type_desc]])","v":"M02B - Centreline 200mm 3x7"},null,"WH","White",null,"RP","Reflectorised Paint"]
[null,"M03","No Overtaking 100mm continuous",{"$f":"_xlfn.CONCAT(marking_type[[#This Row],[marking_type_code]]&\" - \"&marking_type[[#This Row],[marking_type_desc]])","v":"M03 - No Overtaking 100mm continuous"},null,"YE","Yellow",null,"TP","Long Life Flat"]
[null,"M03A","No Overtaking 150mm continuous",{"$f":"_xlfn.CONCAT(marking_type[[#This Row],[marking_type_code]]&\" - \"&marking_type[[#This Row],[marking_type_desc]])","v":"M03A - No Overtaking 150mm continuous"},null,null,null,null,"TC","Thermoplastic - cold"]
[null,"M04","No Overtaking advance 100mm 13 x 7",{"$f":"_xlfn.CONCAT(marking_type[[#This Row],[marking_type_code]]&\" - \"&marking_type[[#This Row],[marking_type_desc]])","v":"M04 - No Overtaking advance 100mm 13 x 7"},null,null,null,null,"TH","Thermoplastic - hot"]
[null,"M04A","No Overtaking 150mm Advance",{"$f":"_xlfn.CONCAT(marking_type[[#This Row],[marking_type_code]]&\" - \"&marking_type[[#This Row],[marking_type_desc]])","v":"M04A - No Overtaking 150mm Advance"}]
[null,"M05","RPM non-reflective",{"$f":"_xlfn.CONCAT(marking_type[[#This Row],[marking_type_code]]&\" - \"&marking_type[[#This Row],[marking_type_desc]])","v":"M05 - RPM non-reflective"}]
[null,"M05A","RPM Solar",{"$f":"_xlfn.CONCAT(marking_type[[#This Row],[marking_type_code]]&\" - \"&marking_type[[#This Row],[marking_type_desc]])","v":"M05A - RPM Solar"}]
[null,"M05B","RPM Inductive",{"$f":"_xlfn.CONCAT(marking_type[[#This Row],[marking_type_code]]&\" - \"&marking_type[[#This Row],[marking_type_desc]])","v":"M05B - RPM Inductive"}]
[null,"M06","RRPM yellow mono-directional",{"$f":"_xlfn.CONCAT(marking_type[[#This Row],[marking_type_code]]&\" - \"&marking_type[[#This Row],[marking_type_desc]])","v":"M06 - RRPM yellow mono-directional"}]
[null,"M07","RRPM white mono-directional",{"$f":"_xlfn.CONCAT(marking_type[[#This Row],[marking_type_code]]&\" - \"&marking_type[[#This Row],[marking_type_desc]])","v":"M07 - RRPM white mono-directional"}]
[null,"M08","RRPM white bi-directional",{"$f":"_xlfn.CONCAT(marking_type[[#This Row],[marking_type_code]]&\" - \"&marking_type[[#This Row],[marking_type_desc]])","v":"M08 - RRPM white bi-directional"}]
[null,"M09","RRPM white/yellow bi-directional",{"$f":"_xlfn.CONCAT(marking_type[[#This Row],[marking_type_code]]&\" - \"&marking_type[[#This Row],[marking_type_desc]])","v":"M09 - RRPM white/yellow bi-directional"}]
[null,"M10","RRPM yellow bi-directional",{"$f":"_xlfn.CONCAT(marking_type[[#This Row],[marking_type_code]]&\" - \"&marking_type[[#This Row],[marking_type_desc]])","v":"M10 - RRPM yellow bi-directional"}]
[null,"M11","RRPM red (edge line) mono-directional",{"$f":"_xlfn.CONCAT(marking_type[[#This Row],[marking_type_code]]&\" - \"&marking_type[[#This Row],[marking_type_desc]])","v":"M11 - RRPM red (edge line) mono-directional"}]
[null,"M12","lane 100mm 3 x 7",{"$f":"_xlfn.CONCAT(marking_type[[#This Row],[marking_type_code]]&\" - \"&marking_type[[#This Row],[marking_type_desc]])","v":"M12 - lane 100mm 3 x 7"}]
[null,"M12A","Lane Line 100mm 1m x 1m",{"$f":"_xlfn.CONCAT(marking_type[[#This Row],[marking_type_code]]&\" - \"&marking_type[[#This Row],[marking_type_desc]])","v":"M12A - Lane Line 100mm 1m x 1m"}]
[null,"M13","Edge 150mm continuous",{"$f":"_xlfn.CONCAT(marking_type[[#This Row],[marking_type_code]]&\" - \"&marking_type[[#This Row],[marking_type_desc]])","v":"M13 - Edge 150mm continuous"}]
[null,"M14","Edge 75mm continuous",{"$f":"_xlfn.CONCAT(marking_type[[#This Row],[marking_type_code]]&\" - \"&marking_type[[#This Row],[marking_type_desc]])","v":"M14 - Edge 75mm continuous"}]
[null,"M15","Edge 100mm continuous",{"$f":"_xlfn.CONCAT(marking_type[[#This Row],[marking_type_code]]&\" - \"&marking_type[[#This Row],[marking_type_desc]])","v":"M15 - Edge 100mm continuous"},null,null,"Contents"]
[null,"M15A","Edge 200mm continuous",{"$f":"_xlfn.CONCAT(marking_type[[#This Row],[marking_type_code]]&\" - \"&marking_type[[#This Row],[marking_type_desc]])","v":"M15A - Edge 200mm continuous"}]
[null,"M16","Painted shoulder",{"$f":"_xlfn.CONCAT(marking_type[[#This Row],[marking_type_code]]&\" - \"&marking_type[[#This Row],[marking_type_desc]])","v":"M16 - Painted shoulder"}]
[null,"M17","Painted island",{"$f":"_xlfn.CONCAT(marking_type[[#This Row],[marking_type_code]]&\" - \"&marking_type[[#This Row],[marking_type_desc]])","v":"M17 - Painted island"}]
[null,"M18","Island pre warn",{"$f":"_xlfn.CONCAT(marking_type[[#This Row],[marking_type_code]]&\" - \"&marking_type[[#This Row],[marking_type_desc]])","v":"M18 - Island pre warn"}]
[null,"M19","Right turn bay",{"$f":"_xlfn.CONCAT(marking_type[[#This Row],[marking_type_code]]&\" - \"&marking_type[[#This Row],[marking_type_desc]])","v":"M19 - Right turn bay"}]
[null,"M20","Pedestrian crossing",{"$f":"_xlfn.CONCAT(marking_type[[#This Row],[marking_type_code]]&\" - \"&marking_type[[#This Row],[marking_type_desc]])","v":"M20 - Pedestrian crossing"}]
[null,"M21","Pedestrian crossing diamond",{"$f":"_xlfn.CONCAT(marking_type[[#This Row],[marking_type_code]]&\" - \"&marking_type[[#This Row],[marking_type_desc]])","v":"M21 - Pedestrian crossing diamond"}]
[null,"M22","Signalised mid-block crosswalk",{"$f":"_xlfn.CONCAT(marking_type[[#This Row],[marking_type_code]]&\" - \"&marking_type[[#This Row],[marking_type_desc]])","v":"M22 - Signalised mid-block crosswalk"}]
[null,"M23","Signalised intersection crosswalk",{"$f":"_xlfn.CONCAT(marking_type[[#This Row],[marking_type_code]]&\" - \"&marking_type[[#This Row],[marking_type_desc]])","v":"M23 - Signalised intersection crosswalk"}]
[null,"M24","Railway crossing",{"$f":"_xlfn.CONCAT(marking_type[[#This Row],[marking_type_code]]&\" - \"&marking_type[[#This Row],[marking_type_desc]])","v":"M24 - Railway crossing"}]
[null,"M25","Emerg exit sig sh white",{"$f":"_xlfn.CONCAT(marking_type[[#This Row],[marking_type_code]]&\" - \"&marking_type[[#This Row],[marking_type_desc]])","v":"M25 - Emerg exit sig sh white"}]
[null,"M26","CROSS ROADS",{"$f":"_xlfn.CONCAT(marking_type[[#This Row],[marking_type_code]]&\" - \"&marking_type[[#This Row],[marking_type_desc]])","v":"M26 - CROSS ROADS"}]
[null,"M27","White Painted Island",{"$f":"_xlfn.CONCAT(marking_type[[#This Row],[marking_type_code]]&\" - \"&marking_type[[#This Row],[marking_type_desc]])","v":"M27 - White Painted Island"}]
[null,"M28","SLOW",{"$f":"_xlfn.CONCAT(marking_type[[#This Row],[marking_type_code]]&\" - \"&marking_type[[#This Row],[marking_type_desc]])","v":"M28 - SLOW"}]
[null,"M29","ONE LANE BRIDGE",{"$f":"_xlfn.CONCAT(marking_type[[#This Row],[marking_type_code]]&\" - \"&marking_type[[#This Row],[marking_type_desc]])","v":"M29 - ONE LANE BRIDGE"}]
[null,"M30","STOP",{"$f":"_xlfn.CONCAT(marking_type[[#This Row],[marking_type_code]]&\" - \"&marking_type[[#This Row],[marking_type_desc]])","v":"M30 - STOP"}]
[null,"M31","GIVE WAY",{"$f":"_xlfn.CONCAT(marking_type[[#This Row],[marking_type_code]]&\" - \"&marking_type[[#This Row],[marking_type_desc]])","v":"M31 - GIVE WAY"}]
[null,"M32","NO LEFT TURN",{"$f":"_xlfn.CONCAT(marking_type[[#This Row],[marking_type_code]]&\" - \"&marking_type[[#This Row],[marking_type_desc]])","v":"M32 - NO LEFT TURN"}]
[null,"M33","NO RIGHT TURN",{"$f":"_xlfn.CONCAT(marking_type[[#This Row],[marking_type_code]]&\" - \"&marking_type[[#This Row],[marking_type_desc]])","v":"M33 - NO RIGHT TURN"}]
[null,"M34","ONE WAY",{"$f":"_xlfn.CONCAT(marking_type[[#This Row],[marking_type_code]]&\" - \"&marking_type[[#This Row],[marking_type_desc]])","v":"M34 - ONE WAY"}]
[null,"M35","NO ENTRY",{"$f":"_xlfn.CONCAT(marking_type[[#This Row],[marking_type_code]]&\" - \"&marking_type[[#This Row],[marking_type_desc]])","v":"M35 - NO ENTRY"}]
[null,"M36","NO TURNS",{"$f":"_xlfn.CONCAT(marking_type[[#This Row],[marking_type_code]]&\" - \"&marking_type[[#This Row],[marking_type_desc]])","v":"M36 - NO TURNS"}]
[null,"M37","NO EXIT",{"$f":"_xlfn.CONCAT(marking_type[[#This Row],[marking_type_code]]&\" - \"&marking_type[[#This Row],[marking_type_desc]])","v":"M37 - NO EXIT"}]
[null,"M38","Speed circles",{"$f":"_xlfn.CONCAT(marking_type[[#This Row],[marking_type_code]]&\" - \"&marking_type[[#This Row],[marking_type_desc]])","v":"M38 - Speed circles"}]
[null,"M3850","Speed circle 50km/h",{"$f":"_xlfn.CONCAT(marking_type[[#This Row],[marking_type_code]]&\" - \"&marking_type[[#This Row],[marking_type_desc]])","v":"M3850 - Speed circle 50km/h"}]
[null,"M3860","Speed circle 60km/h",{"$f":"_xlfn.CONCAT(marking_type[[#This Row],[marking_type_code]]&\" - \"&marking_type[[#This Row],[marking_type_desc]])","v":"M3860 - Speed circle 60km/h"}]
[null,"M3870","Speed circle 70km/h",{"$f":"_xlfn.CONCAT(marking_type[[#This Row],[marking_type_code]]&\" - \"&marking_type[[#This Row],[marking_type_desc]])","v":"M3870 - Speed circle 70km/h"}]
[null,"M3880","Speed circle 80km/h",{"$f":"_xlfn.CONCAT(marking_type[[#This Row],[marking_type_code]]&\" - \"&marking_type[[#This Row],[marking_type_desc]])","v":"M3880 - Speed circle 80km/h"}]
[null,"M40","straight arrow",{"$f":"_xlfn.CONCAT(marking_type[[#This Row],[marking_type_code]]&\" - \"&marking_type[[#This Row],[marking_type_desc]])","v":"M40 - straight arrow"}]
[null,"M41","right turn arrow",{"$f":"_xlfn.CONCAT(marking_type[[#This Row],[marking_type_code]]&\" - \"&marking_type[[#This Row],[marking_type_desc]])","v":"M41 - right turn arrow"}]
[null,"M42","Left turn arrow",{"$f":"_xlfn.CONCAT(marking_type[[#This Row],[marking_type_code]]&\" - \"&marking_type[[#This Row],[marking_type_desc]])","v":"M42 - Left turn arrow"}]
[null,"M43","Combination arrows",{"$f":"_xlfn.CONCAT(marking_type[[#This Row],[marking_type_code]]&\" - \"&marking_type[[#This Row],[marking_type_desc]])","v":"M43 - Combination arrows"}]
[null,"M44","TURN LEFT",{"$f":"_xlfn.CONCAT(marking_type[[#This Row],[marking_type_code]]&\" - \"&marking_type[[#This Row],[marking_type_desc]])","v":"M44 - TURN LEFT"}]
[null,"M45","TURN RIGHT",{"$f":"_xlfn.CONCAT(marking_type[[#This Row],[marking_type_code]]&\" - \"&marking_type[[#This Row],[marking_type_desc]])","v":"M45 - TURN RIGHT"}]
[null,"M46","KEEP CLEAR",{"$f":"_xlfn.CONCAT(marking_type[[#This Row],[marking_type_code]]&\" - \"&marking_type[[#This Row],[marking_type_desc]])","v":"M46 - KEEP CLEAR"}]
[null,"M47","DISABLED PARKING",{"$f":"_xlfn.CONCAT(marking_type[[#This Row],[marking_type_code]]&\" - \"&marking_type[[#This Row],[marking_type_desc]])","v":"M47 - DISABLED PARKING"}]
[null,"M48","NO PARKING",{"$f":"_xlfn.CONCAT(marking_type[[#This Row],[marking_type_code]]&\" - \"&marking_type[[#This Row],[marking_type_desc]])","v":"M48 - NO PARKING"}]
[null,"M49","CHILDREN",{"$f":"_xlfn.CONCAT(marking_type[[#This Row],[marking_type_code]]&\" - \"&marking_type[[#This Row],[marking_type_desc]])","v":"M49 - CHILDREN"}]
[null,"M50","STOP AHEAD",{"$f":"_xlfn.CONCAT(marking_type[[#This Row],[marking_type_code]]&\" - \"&marking_type[[#This Row],[marking_type_desc]])","v":"M50 - STOP AHEAD"}]
[null,"M51","GIVE WAY AHEAD",{"$f":"_xlfn.CONCAT(marking_type[[#This Row],[marking_type_code]]&\" - \"&marking_type[[#This Row],[marking_type_desc]])","v":"M51 - GIVE WAY AHEAD"}]
[null,"M52","PED. CROSS AHEAD",{"$f":"_xlfn.CONCAT(marking_type[[#This Row],[marking_type_code]]&\" - \"&marking_type[[#This Row],[marking_type_desc]])","v":"M52 - PED. CROSS AHEAD"}]
[null,"M53","SCHOOL PATROL",{"$f":"_xlfn.CONCAT(marking_type[[#This Row],[marking_type_code]]&\" - \"&marking_type[[#This Row],[marking_type_desc]])","v":"M53 - SCHOOL PATROL"}]
[null,"M55","Destination Legend",{"$f":"_xlfn.CONCAT(marking_type[[#This Row],[marking_type_code]]&\" - \"&marking_type[[#This Row],[marking_type_desc]])","v":"M55 - Destination Legend"}]
[null,"M56","SCHOOL",{"$f":"_xlfn.CONCAT(marking_type[[#This Row],[marking_type_code]]&\" - \"&marking_type[[#This Row],[marking_type_desc]])","v":"M56 - SCHOOL"}]
[null,"M57","SPEED HUMP",{"$f":"_xlfn.CONCAT(marking_type[[#This Row],[marking_type_code]]&\" - \"&marking_type[[#This Row],[marking_type_desc]])","v":"M57 - SPEED HUMP"}]
[null,"M58","Painted Speed Hump",{"$f":"_xlfn.CONCAT(marking_type[[#This Row],[marking_type_code]]&\" - \"&marking_type[[#This Row],[marking_type_desc]])","v":"M58 - Painted Speed Hump"}]
[null,"M59","Intersection Continuity Lines (150mm 1 x 3)",{"$f":"_xlfn.CONCAT(marking_type[[#This Row],[marking_type_code]]&\" - \"&marking_type[[#This Row],[marking_type_desc]])","v":"M59 - Intersection Continuity Lines (150mm 1 x 3)"}]
[null,"M59A","Intersection Continuity Lines (200mm 1 x 3)",{"$f":"_xlfn.CONCAT(marking_type[[#This Row],[marking_type_code]]&\" - \"&marking_type[[#This Row],[marking_type_desc]])","v":"M59A - Intersection Continuity Lines (200mm 1 x 3)"}]
[null,"M59B","Intersection Continuity Lines 100mm (1 x 3)",{"$f":"_xlfn.CONCAT(marking_type[[#This Row],[marking_type_code]]&\" - \"&marking_type[[#This Row],[marking_type_desc]])","v":"M59B - Intersection Continuity Lines 100mm (1 x 3)"}]
[null,"M60","No Stopping Line (yellow) 100mm 1 x 1",{"$f":"_xlfn.CONCAT(marking_type[[#This Row],[marking_type_code]]&\" - \"&marking_type[[#This Row],[marking_type_desc]])","v":"M60 - No Stopping Line (yellow) 100mm 1 x 1"}]
[null,"M61","Loading zone",{"$f":"_xlfn.CONCAT(marking_type[[#This Row],[marking_type_code]]&\" - \"&marking_type[[#This Row],[marking_type_desc]])","v":"M61 - Loading zone"}]
[null,"M62","Bus stop",{"$f":"_xlfn.CONCAT(marking_type[[#This Row],[marking_type_code]]&\" - \"&marking_type[[#This Row],[marking_type_desc]])","v":"M62 - Bus stop"}]
[null,"M63","Taxi stand",{"$f":"_xlfn.CONCAT(marking_type[[#This Row],[marking_type_code]]&\" - \"&marking_type[[#This Row],[marking_type_desc]])","v":"M63 - Taxi stand"}]
[null,"M64","Other zone",{"$f":"_xlfn.CONCAT(marking_type[[#This Row],[marking_type_code]]&\" - \"&marking_type[[#This Row],[marking_type_desc]])","v":"M64 - Other zone"}]
[null,"M65","Park Limit Lines parallel",{"$f":"_xlfn.CONCAT(marking_type[[#This Row],[marking_type_code]]&\" - \"&marking_type[[#This Row],[marking_type_desc]])","v":"M65 - Park Limit Lines parallel"}]
[null,"M66","Park meter bays",{"$f":"_xlfn.CONCAT(marking_type[[#This Row],[marking_type_code]]&\" - \"&marking_type[[#This Row],[marking_type_desc]])","v":"M66 - Park meter bays"}]
[null,"M67","Park bays angle",{"$f":"_xlfn.CONCAT(marking_type[[#This Row],[marking_type_code]]&\" - \"&marking_type[[#This Row],[marking_type_desc]])","v":"M67 - Park bays angle"}]
[null,"M70","Fire hydrant",{"$f":"_xlfn.CONCAT(marking_type[[#This Row],[marking_type_code]]&\" - \"&marking_type[[#This Row],[marking_type_desc]])","v":"M70 - Fire hydrant"}]
[null,"M71","CAUTION",{"$f":"_xlfn.CONCAT(marking_type[[#This Row],[marking_type_code]]&\" - \"&marking_type[[#This Row],[marking_type_desc]])","v":"M71 - CAUTION"}]
[null,"M72","CYCLE LANE",{"$f":"_xlfn.CONCAT(marking_type[[#This Row],[marking_type_code]]&\" - \"&marking_type[[#This Row],[marking_type_desc]])","v":"M72 - CYCLE LANE"}]
[null,"M73","Cycle symbol",{"$f":"_xlfn.CONCAT(marking_type[[#This Row],[marking_type_code]]&\" - \"&marking_type[[#This Row],[marking_type_desc]])","v":"M73 - Cycle symbol"}]
[null,"M74","Flush Median",{"$f":"_xlfn.CONCAT(marking_type[[#This Row],[marking_type_code]]&\" - \"&marking_type[[#This Row],[marking_type_desc]])","v":"M74 - Flush Median"}]
[null,"M75","BUS LANE",{"$f":"_xlfn.CONCAT(marking_type[[#This Row],[marking_type_code]]&\" - \"&marking_type[[#This Row],[marking_type_desc]])","v":"M75 - BUS LANE"}]
[null,"M76","BUS LANE ENDS",{"$f":"_xlfn.CONCAT(marking_type[[#This Row],[marking_type_code]]&\" - \"&marking_type[[#This Row],[marking_type_desc]])","v":"M76 - BUS LANE ENDS"}]
[null,"M77","Traffic Signal Limit Lines",{"$f":"_xlfn.CONCAT(marking_type[[#This Row],[marking_type_code]]&\" - \"&marking_type[[#This Row],[marking_type_desc]])","v":"M77 - Traffic Signal Limit Lines"}]
[null,"M78","Give Way Limit Line",{"$f":"_xlfn.CONCAT(marking_type[[#This Row],[marking_type_code]]&\" - \"&marking_type[[#This Row],[marking_type_desc]])","v":"M78 - Give Way Limit Line"}]
[null,"M79","Stop Limit Lines",{"$f":"_xlfn.CONCAT(marking_type[[#This Row],[marking_type_code]]&\" - \"&marking_type[[#This Row],[marking_type_desc]])","v":"M79 - Stop Limit Lines"}]
[null,"M80","Convex Mirror",{"$f":"_xlfn.CONCAT(marking_type[[#This Row],[marking_type_code]]&\" - \"&marking_type[[#This Row],[marking_type_desc]])","v":"M80 - Convex Mirror"}]
[null,"M81","Give Way Triangle Symbol",{"$f":"_xlfn.CONCAT(marking_type[[#This Row],[marking_type_code]]&\" - \"&marking_type[[#This Row],[marking_type_desc]])","v":"M81 - Give Way Triangle Symbol"}]
[null,"M82","T2 Lanes",{"$f":"_xlfn.CONCAT(marking_type[[#This Row],[marking_type_code]]&\" - \"&marking_type[[#This Row],[marking_type_desc]])","v":"M82 - T2 Lanes"}]
[null,"M83","Coloured surfacing",{"$f":"_xlfn.CONCAT(marking_type[[#This Row],[marking_type_code]]&\" - \"&marking_type[[#This Row],[marking_type_desc]])","v":"M83 - Coloured surfacing"}]
[null,"M84","Centreline 100mm continuous - Profiled",{"$f":"_xlfn.CONCAT(marking_type[[#This Row],[marking_type_code]]&\" - \"&marking_type[[#This Row],[marking_type_desc]])","v":"M84 - Centreline 100mm continuous - Profiled"}]
[null,"M84A","Centreline 150mm continuous- Profiled",{"$f":"_xlfn.CONCAT(marking_type[[#This Row],[marking_type_code]]&\" - \"&marking_type[[#This Row],[marking_type_desc]])","v":"M84A - Centreline 150mm continuous- Profiled"}]
[null,"M85","Centreline 100mm 3 x 7 - Profiled",{"$f":"_xlfn.CONCAT(marking_type[[#This Row],[marking_type_code]]&\" - \"&marking_type[[#This Row],[marking_type_desc]])","v":"M85 - Centreline 100mm 3 x 7 - Profiled"}]
[null,"M85A","Centreline 150 3 x 7 - Profiled",{"$f":"_xlfn.CONCAT(marking_type[[#This Row],[marking_type_code]]&\" - \"&marking_type[[#This Row],[marking_type_desc]])","v":"M85A - Centreline 150 3 x 7 - Profiled"}]
[null,"M86","Edge 100mm continuous - Profiled",{"$f":"_xlfn.CONCAT(marking_type[[#This Row],[marking_type_code]]&\" - \"&marking_type[[#This Row],[marking_type_desc]])","v":"M86 - Edge 100mm continuous - Profiled"}]
[null,"M87","Edge 150mm continuous - Profiled",{"$f":"_xlfn.CONCAT(marking_type[[#This Row],[marking_type_code]]&\" - \"&marking_type[[#This Row],[marking_type_desc]])","v":"M87 - Edge 150mm continuous - Profiled"}]
[null,"M88","No Overtaking 100mm continuous - Profiled",{"$f":"_xlfn.CONCAT(marking_type[[#This Row],[marking_type_code]]&\" - \"&marking_type[[#This Row],[marking_type_desc]])","v":"M88 - No Overtaking 100mm continuous - Profiled"}]
[null,"M88A","No Overtaking 150mm continuous - Profiled",{"$f":"_xlfn.CONCAT(marking_type[[#This Row],[marking_type_code]]&\" - \"&marking_type[[#This Row],[marking_type_desc]])","v":"M88A - No Overtaking 150mm continuous - Profiled"}]
[null,"M88B","No Overtaking 200mm continuous - Profiled",{"$f":"_xlfn.CONCAT(marking_type[[#This Row],[marking_type_code]]&\" - \"&marking_type[[#This Row],[marking_type_desc]])","v":"M88B - No Overtaking 200mm continuous - Profiled"}]
[null,"M89","No Overtaking advance 100mm 13 x 7 - Profiled",{"$f":"_xlfn.CONCAT(marking_type[[#This Row],[marking_type_code]]&\" - \"&marking_type[[#This Row],[marking_type_desc]])","v":"M89 - No Overtaking advance 100mm 13 x 7 - Profiled"}]
[null,"M89A","No Overtaking advance 150mm 13 x 7 - Profiled",{"$f":"_xlfn.CONCAT(marking_type[[#This Row],[marking_type_code]]&\" - \"&marking_type[[#This Row],[marking_type_desc]])","v":"M89A - No Overtaking advance 150mm 13 x 7 - Profiled"}]
[null,"M90","Painted Island 100mm continuous profiled",{"$f":"_xlfn.CONCAT(marking_type[[#This Row],[marking_type_code]]&\" - \"&marking_type[[#This Row],[marking_type_desc]])","v":"M90 - Painted Island 100mm continuous profiled"}]
[null,"MWV","Water Valve",{"$f":"_xlfn.CONCAT(marking_type[[#This Row],[marking_type_code]]&\" - \"&marking_type[[#This Row],[marking_type_desc]])","v":"MWV - Water Valve"}]

{"sheet":"LU Road Names","index":33,"n_rows":990,"n_cols":5,"rows_kept":990,"cut":false,"hidden":false,"merged":[]}
["Contents"]
[null,"road_id","road_name","min_start","max_end"]
[null,"N/A","NEW ROAD",0,99999]
[null,91318,"002-0100",0,14785]
[null,91319,"002-0116",0,14110]
[null,91322,"002-0130",0,610]
[null,93765,"002-0130/00.61-D",610,1517]
[null,93763,"002-0130/00.61-I",610,1517]
[null,93764,"002-0130/01.51",1517,13917]
[null,93768,"002-0130/13.91-D",13917,14193]
[null,93766,"002-0130/13.91-I",13917,14193]
[null,93784,"002-0130/14.25-D",14252,14546]
[null,93783,"002-0130/14.25-I",14252,14546]
[null,93767,"002-0130/14.55",14546,16497]
[null,93761,"002-0144-W",0,116]
[null,91725,"002-0146",0,1128]
[null,93788,"002-0146/01.13-D",1128,1249]
[null,93787,"002-0146/01.13-I",1128,1249]
[null,93213,"002-0146/01.30-D",1298,1694]
[null,93211,"002-0146/01.30-I",1298,1694]
[null,93212,"002-0146/01.75",1746,2133]
[null,92844,"002-0146/02.13-D",2133,5162]
[null,92843,"002-0146/02.13-I",2133,5137]
[null,93487,"002-0147-W",0,92]
[null,93490,"002-0148-W",0,88]
[null,92845,"002-0149-R1",0,185]
[null,92846,"002-0149-R2",0,203]
[null,92668,"002-0149-R3",0,175]
[null,92654,"002-0150-R1",0,211]
[null,92847,"002-0150-R2",0,291]
[null,92849,"002-0151/02.48-D-CO29",2484,6437]
[null,93494,"002-0151-D-CO29",0,2416]
[null,92848,"002-0151-I-CO29",0,6396]
[null,93178,"002-0151-R1",0,1273]
[null,93187,"002-0151-R2",0,946]
[null,93117,"002-0151-R3",0,98]
[null,92661,"002-0152-R1",0,73]
[null,92662,"002-0152-R2",0,304]
[null,91327,"002-0152-R3",0,193]
[null,93495,"002-0152-R4",0,183]
[null,93497,"002-0152-W",0,56]
[null,92658,"002-0153-R1",0,256]
[null,92663,"002-0153-R2",0,194]
[null,92505,"002-0154-W-CO29",0,109]
[null,93180,"002-0155-R1",0,304]
[null,93181,"002-0155-R2",0,398]
[null,93182,"002-0155-R3",0,149]
[null,93183,"002-0155-R4",0,116]
[null,93184,"002-0155-R5",0,128]
[null,93185,"002-0155-R6",0,169]
[null,93186,"002-0155-R7",0,762]
[null,93524,"002-0155-R8",0,206]
[null,93526,"002-0155-R9",0,154]
[null,93048,"002-0157/01.41",1410,3604]
[null,93198,"002-0157/03.66",3664,4408]
[null,93075,"002-0157-D",0,1408]
[null,93074,"002-0157-I",0,1410]
[null,93500,"002-0158-W",0,103]
[null,93049,"002-0159-R1",0,291]
[null,93050,"002-0159-R2",0,706]
[null,93051,"002-0159-R3",0,463]
[null,93626,"002-0159-R4",0,300]
[null,93052,"002-0159-R5",0,72]
[null,93625,"002-0159-R6",0,71]
[null,93498,"002-0159-W",0,82]
[null,93032,"002-0161-W",0,94]
[null,93025,"002-0163-W",0,88]
[null,93458,"002-0164-D",0,13644]
[null,93457,"002-0164-I",0,13654]
[null,93475,"002-0164-R1",0,184]
[null,93461,"002-0166-R1",0,258]
[null,93462,"002-0166-R2",0,238]
[null,93463,"002-0166-R3",0,278]
[null,93464,"002-0166-R4",0,249]
[null,93465,"002-0167-R1",0,222]
[null,93466,"002-0167-R2",0,340]
[null,93467,"002-0168-R1",0,222]
[null,93468,"002-0168-R2",0,348]
[null,93470,"002-0171-R1",0,321]
[null,93471,"002-0171-R2",0,284]
[null,93472,"002-0171-R3",0,488]
[null,93473,"002-0171-R4",0,394]
[null,93474,"002-0171-R5",0,179]
[null,93460,"002-0177-D",0,7356]
[null,93459,"002-0177-I",0,7350]
[null,93483,"002-0184-R1",0,100]
[null,93484,"002-0184-R2",0,80]
[null,93419,"002-0184-W",0,220]
[null,93800,"002-0185/00.22",221,19951]
[null,93801,"002-0185-D",0,221]
[null,91343,"002-0185-I",0,221]
[null,93519,"029-0007/04.02-I-CO2",4021,6437]
[null,93521,"029-0007-D-CO2",0,6396]
[null,93518,"029-0007-I-CO2",0,3953]
[null,93520,"029-0011-W-CO2",0,109]
[null,93517,"029-0014/01.47",1467,4883]
[null,93778,"029-0014/04.88-D",4883,5196]
[null,93777,"029-0014/04.88-I",4883,5196]
[null,92660,"029-0014-D",0,1512]
[null,92659,"029-0014-I",0,1467]
[null,93762,"029-0018-R1",0,115]
[null,92855,"029-0018-W",0,206]
[null,93802,"029-0019/00.14",140,1727]
[null,93803,"029-0019-D",0,140]
[null,93246,"029-0019-I",0,140]
[null,91721,"029-0021",0,20937]
[null,91280,"033-0017",0,18455]
[null,93799,"033-0017/18.45-D",18455,18655]
[null,93798,"033-0017/18.45-I",18455,18665]
[null,93537,"033-0035-R1",0,55]
[null,92006,"033-0036",0,1]
[null,93792,"036-0000/00.43-D",427,595]
[null,93507,"036-0000/00.43-I",427,595]
[null,93791,"036-0000/00.59",595,1952]
[null,93794,"036-0000/01.95-D",1952,2120]
[null,93793,"036-0000/01.95-I",1952,2120]
[null,93797,"036-0000/02.18-D",2183,2300]
[null,93510,"036-0000/02.18-I",2183,2300]
[null,93796,"036-0000/02.30",2300,4311]
[null,93795,"036-0000/04.38-D",4382,4532]
[null,93513,"036-0000/04.38-I",4382,4532]
[null,93243,"036-0000-D",0,301]
[null,93237,"036-0000-I",0,324]
[null,93508,"036-0001-W",0,206]
[null,93512,"036-0002-W",0,131]
[null,93514,"036-0003-W",0,133]
[null,93236,"036-0004",0,9191]
[null,92832,"036-0013",0,15895]
[null,93502,"29A-0000/00.16-D",155,4332]
[null,93501,"29A-0000/00.19-I",189,4314]
[null,93769,"29A-0000/04.34",4314,6906]
[null,91331,"29A-0000/06.91-D",6906,7151]
[null,93118,"29A-0000/06.91-I",6906,7184]
[null,93021,"29A-0000-D",0,107]
[null,93023,"29A-0000-I",0,111]
[null,93024,"29A-0001-W",0,109]
[null,91334,"29A-0005-R1",0,203]
[null,91335,"29A-0005-R2",0,120]
[null,93119,"29A-0007-W",0,269]
[null,91439,"29A-0008/00.28",282,2060]
[null,93790,"29A-0008/02.06-D",2060,2240]
[null,93789,"29A-0008/02.06-I",2060,2240]
[null,93504,"29A-0008/02.30",2304,3317]
[null,93505,"29A-0008/03.42",3418,4974]
[null,93506,"29A-0008/05.02",5022,6419]
[null,93121,"29A-0008-D",0,214]
[null,93120,"29A-0008-I",0,225]
[null,93503,"29A-0009-W",0,104]
[null,92852,"29A-0010-W",0,116]
[null,92853,"29A-0011-W",0,202]
[null,92854,"29A-0012-W",0,110]
[null,93527,"29A-0013",0,1]
[null,1014,"ADELA STEWART DRIVE",0,91]
[null,1011,"ADELA STEWART DRIVE WEST",0,233]
[null,1930,"ADRINE LANE",0,112]
[null,1308,"AINSWORTH ROAD",0,942]
[null,1008,"ALBACORE AVENUE",0,100]
[null,1213,"ALBERT LANE",0,280]
[null,1094,"ALEXANDER STREET",0,271]
[null,1951,"ALLANAH PLACE",0,120]
[null,1489,"ALLEY ROAD",0,1007]
[null,1644,"ALLPORT ROAD",0,8653]
[null,1172,"ANATERE RISE",0,110]
[null,1263,"ANDERLEY AVENUE",0,593]
[null,1209,"ANDERSON LANE",0,542]
[null,1637,"ANGLAND DRIVE",0,575]
[null,1197,"ANGLERS WAY",0,92]
[null,1830,"ANGUS LANE",0,62]
[null,1863,"AONGATETE ROAD",0,225]
[null,1182,"APATA STATION ROAD",0,1320]
[null,1770,"ARAN PLACE",0,83]
[null,1546,"ARAWA AVENUE",0,2685]
[null,1570,"ARAWA ROAD",0,540]
[null,1988,"ARDEN ROAD",0,153]
[null,1250,"ARMSTRONG ROAD",0,1907]
[null,1129,"ASH LANE",0,111]
[null,1851,"ASHWOOD GROVE",0,66]
[null,1871,"ASTELIA DRIVE",0,123]
[null,1884,"ATHENREE HEIGHTS",0,352]
[null,7159,"ATHENREE HEIGHTS/SEA VISTA RAB",0,56]
[null,1019,"ATHENREE ROAD",0,3963]
[null,7160,"ATHENREE ROAD SLIP (RP15 RHS)",0,119]
[null,7253,"ATHENREE ROAD SLIP RP3679",0,57]
[null,1891,"ATLANTA COURT",0,76]
[null,1730,"ATUAROA AVENUE",0,802]
[null,7231,"ATUAROA AVENUE SERVICE LANE (RP42 LHS)",0,79]
[null,1327,"AUGUSTA RISE",0,286]
[null,1836,"AYR STREET",0,105]
[null,1038,"BAIGENT PLACE",0,183]
[null,1121,"BAKER ROAD",0,145]
[null,1932,"BALLANTYNE WAY",0,861]
[null,7248,"BALLANTYNE WAY/CARNOUSTIE PLACE RAB",0,55]
[null,7246,"BALLANTYNE WAY/TROON DRIVE RAB",0,55]
[null,1149,"BANKS DRIVE",0,262]
[null,1769,"BARNETT PLACE",0,44]
[null,1211,"BARRETT ROAD",0,532]
[null,1743,"BARROW PLACE",0,112]
[null,1496,"BAYLISS ROAD",0,440]
[null,1740,"BAYLY PLACE",0,83]
[null,1620,"BAYLY ROAD",0,272]
[null,1845,"BAYVIEW STREET",0,202]
[null,7272,"BEACH ACCESS (OTAMARAKAU)",0,490]
[null,1268,"BEACH GROVE",0,188]
[null,1089,"BEACH ROAD (KATIKATI)",0,3049]
[null,1551,"BEACH ROAD (MAKETU)",0,571]
[null,1883,"BEACH ROAD (WAIHI BEACH)",0,1322]
[null,7214,"BEACH ROAD/PARK ROAD RAB",0,51]
[null,7254,"BEACH ROAD/SEAVIEW ROAD RAB",0,47]
[null,7241,"BEACH ROAD/WILSON ROAD RAB",0,57]
[null,1749,"BEATTY AVENUE",0,723]
[null,1321,"BELK ROAD",2060,8208]
[null,1598,"BELK ROAD SOUTH",0,1951]
[null,1386,"BELL ROAD",0,5943]
[null,1887,"BELMONT RISE",0,183]
[null,1752,"BELVEDERE STREET",0,294]
[null,1792,"BEN KEYS STREET",0,332]
[null,1654,"BENNER ROAD",0,4045]
[null,1983,"BERT WALL DRIVE",0,638]
[null,1338,"BETTY MAY DRIVE",0,580]
[null,1670,"BILLING ROAD",0,2334]
[null,1072,"BINNIE ROAD",0,192]
[null,7147,"BIRCH LANE",0,107]
[null,1738,"BISHOPRICK CRESCENT",0,258]
[null,1584,"BLACK ROAD",0,2176]
[null,1566,"BLEDISLOE PARK AVENUE",0,1301]
[null,1095,"BLUNDELL PLACE",0,193]
[null,1003,"BONITO AVENUE",0,137]
[null,1595,"BONNIEGLEN ROAD",0,79]
[null,2595,"BONNIEGLEN ROAD (CENTRAL)",0,90]
[null,1648,"BONNY DALE LANE",0,405]
[null,1245,"BORELL ROAD",0,1553]
[null,1775,"BOUCHER AVENUE",0,2235]
[null,7310,"BOUCHER AVENUE CARPARK NORTH",0,42]
[null,7311,"BOUCHER AVENUE CARPARK SOUTH",0,65]
[null,7176,"BOUCHER AVENUE NORTH",0,74]
[null,7204,"BOUCHER AVENUE SERVICE LANE (RP69 LHS)",0,107]
[null,7309,"BOUCHER SVCE TO TE PUKE HIGHWAY SERVICE LANE",0,62]
[null,1880,"BOWENTOWN BOULEVARD",0,709]
[null,1087,"BOYD STREET",0,376]
[null,1277,"BRAMLEY DRIVE",0,149]
[null,1915,"BRANSLEY GROVE",0,108]
[null,1941,"BREAKERS CRESCENT",0,55]
[null,1193,"BRENDON CLOSE",0,78]
[null,1030,"BRIDGMAN LANE",0,326]
[null,1161,"BRIDLE WAY",0,137]
[null,1816,"BRIGHTON ROAD",0,469]
[null,1002,"BROADWAY ROAD",0,1353]
[null,1919,"BROOKBY PLACE",0,63]
[null,1509,"BROWN ROAD",0,4301]
[null,1750,"BROWN TERRACE",0,205]
[null,1814,"BROWNS DRIVE",0,594]
[null,1208,"BRUNTWOOD DRIVE",0,465]
[null,1607,"BURD ROAD",0,2150]
[null,1065,"BUSBY ROAD",0,4133]
[null,1747,"CAMERON ROAD",0,2192]
[null,1668,"CAMPBELL ROAD",0,9364]
[null,1903,"CANNELL FARM DRIVE",0,495]
[null,7181,"CANNELL FARM DRIVE/NORM FREEMAN DRIVE RAB",0,59]
[null,1039,"CANON ROAD",0,410]
[null,1025,"CAPAMAGIAN DRIVE",0,1998]
[null,1734,"CARBERRY CRESCENT",0,85]
[null,1100,"CARISBROOKE STREET",0,570]
[null,1936,"CARNOUSTIE PLACE",0,158]
[null,7315,"CARNOUSTIE PLACE HAMMERHEAD",0,46]
[null,1152,"CARRIAGE CLOSE",0,65]
[null,1056,"CASTLEGRACE DRIVE",0,358]
[null,1470,"CASTLES ROAD",0,475]
[null,4015,"CASTLES ROAD NORTH",0,302]
[null,1641,"CASUARINA DRIVE",0,2516]
[null,1131,"CHARD ROAD",0,531]
[null,1027,"CHARLOTTE DRIVE",0,374]
[null,1781,"CHAYTOR STREET",0,208]
[null,1506,"CHEETHAM AVENUE",0,332]
[null,1049,"CHELMSFORD STREET",0,818]
[null,1555,"CHURCH ROAD",0,146]
[null,1082,"CHURCH STREET",0,289]
[null,1829,"CITRUS AVENUE",0,1035]
[null,1638,"CLARK ROAD",0,711]
[null,1251,"CLARKE ROAD",0,1942]
[null,1796,"CLIFDEN TERRACE",0,80]
[null,1091,"CLIVE ROAD",0,276]
[null,1762,"CLYDESBURN AVENUE",0,373]
[null,1954,"COLEMAN PLACE",0,133]
[null,1498,"COLLINS LANE",0,307]
[null,1794,"COMMERCE LANE",0,381]
[null,1785,"CONIFER PLACE",0,137]
[null,1120,"CONNELLY LANE",0,365]
[null,1583,"CONWAY ROAD",0,749]
[null,1777,"COONEY PLACE",0,100]
[null,1270,"COPPELIA AVENUE",0,455]
[null,1315,"CORBETT DRIVE",0,501]
[null,1577,"COSTELLO CRESCENT",0,345]
[null,1304,"CRAWFORD ROAD",0,6601]
[null,1953,"CRESTA DRIVE",0,49]
[null,1866,"CROSBY LANE",0,280]
[null,1080,"CROSSLEY STREET (NORTH)",0,348]
[null,1839,"CROSSLEY STREET (SOUTH)",0,61]
[null,1531,"CRUICKSHANK LANE",0,465]
[null,1574,"CUTWATER ROAD",0,3426]
[null,1708,"DAWN VIEW PLACE",0,344]
[null,1878,"DAWSON ROAD (PRIVATE)",0,54]
[null,1858,"DEKKER ROAD",0,288]
[null,1615,"DEMETER ROAD",0,380]
[null,1015,"DENBY CLOSE",0,41]
[null,1840,"DIDSBURY DRIVE",0,227]
[null,1819,"DILLON STREET",0,1169]
[null,1007,"DOLPHIN AVENUE",0,100]
[null,1896,"DONEGAL PLACE",0,141]
[null,1939,"DONELLE PLACE",0,68]
[null,1736,"DONOVAN STREET",0,367]
[null,1926,"DOWMAN PLACE",0,78]
[null,1503,"DUDLEY VERCOE DRIVE",0,893]
[null,1659,"DUNCAN LANE",0,63]
[null,1731,"DUNLOP ROAD",0,1076]
[null,7230,"DUNLOP ROAD SERVICE LANE (RP55 RHS)",0,77]
[null,1861,"DYER STRAIGHT",0,526]
[null,1107,"EARL DRIVE",0,274]
[null,7102,"EARL DRIVE SERVICE LANE",0,55]
[null,1331,"EAST BANK DRIVE",0,243]
[null,1795,"EDGEHILL PLACE",0,231]
[null,1825,"EDINBURGH STREET",0,466]
[null,1458,"EDWARD AVENUE",0,328]
[null,1841,"EDWARDS STREET",0,135]
[null,7366,"ELIZA PLACE",0,62]
[null,1821,"ELIZABETH STREET",0,112]
[null,1144,"ELMWOOD ROAD",0,1051]
[null,1219,"EMENY ROAD",0,644]
[null,2219,"EMENY ROAD NORTH",0,57]
[null,1024,"EMERTON ROAD",0,1640]
[null,1186,"ESDAILE ROAD",0,7593]
[null,1113,"ESPLANADE ROAD (KAURI POINT)",0,391]
[null,1048,"ESPLANADE ROAD (ONGARE POINT)",0,326]
[null,1228,"FAIRLIE GROVE",0,100]
[null,1773,"FAIRVIEW PLACE",0,579]
[null,1092,"FAIRVIEW ROAD",0,1259]
[null,1313,"FAIRWAY VIEW DRIVE",0,157]
[null,1828,"FARM ROAD",0,65]
[null,1269,"FARNELL COURT",0,66]
[null,1093,"FENCOURT CRESCENT",0,102]
[null,1764,"FENTON TERRACE",0,210]
[null,7067,"FENTON TERRACE SLIP",0,68]
[null,1848,"FERGUS ROAD",0,1197]
[null,1192,"FINTONA STREET",0,63]
[null,1950,"FLEUR PLACE",0,83]
[null,1318,"FLORENCE LANE",0,285]
[null,1224,"FLOUNDER DRIVE",0,112]
[null,7326,"FLOUNDER DRIVE/STRINGRAY DRIVE RAB",0,52]
[null,1534,"FORD ROAD",0,1791]
[null,1068,"FRANCIS DRIVE",0,466]
[null,1205,"FRANCIS ROAD",0,706]
[null,1994,"FRIIS DRIVE",0,88]
[null,1811,"FYFE ROAD",0,458]
[null,1771,"GALWAY PLACE",0,120]
[null,1605,"GAMMAN MILL ROAD",0,840]
[null,1261,"GANE PLACE",0,128]
[null,1578,"GARDINER PLACE",0,68]
[null,1484,"GARRETT ROAD",0,680]
[null,1282,"GELLIBRAND PLACE",0,107]
[null,1787,"GEORGE STREET",0,224]
[null,1281,"GERALD PLACE",0,49]
[null,1037,"GILES WAY",0,129]
[null,1105,"GILFILLAN DRIVE",0,371]
[null,1217,"GILL LANE",0,798]
[null,1755,"GILMORE STREET",0,242]
[null,1746,"GISBORNE ROAD",0,188]
[null,1090,"GLEDSTANE ROAD",0,126]
[null,1837,"GLEN ISLA PLACE",0,130]
[null,1756,"GLEN TERRACE",0,280]
[null,1935,"GLENEAGLES DRIVE",0,234]
[null,7244,"GLENEAGLES DRIVE/BALLANTYNE WAY RAB",0,55]
[null,1604,"GLUE POT ROAD",0,4577]
[null,1191,"GOLDSTONE PLACE",0,111]
[null,1710,"GOLDSTONE ROAD",0,190]
[null,1895,"GORDET DRIVE",0,128]
[null,1790,"GORDON STREET",0,123]
[null,1062,"GRAMMER ROAD",0,806]
[null,1843,"GRAY AVENUE",0,179]
[null,7300,"GRAY STREET (NORTH)",0,66]
[null,1079,"GRAY STREET (SOUTH)",0,139]
[null,1975,"GREYSTONE PLACE",0,101]
[null,1523,"GRIDLEY ROAD",0,1931]
[null,1449,"GRIFFIN ROAD",0,1517]
[null,1888,"GROSVENOR PLACE",0,90]
[null,1529,"GULLIVER ROAD",0,1392]
[null,1892,"GUNGA LANE",0,135]
[null,1964,"HADEN PLACE",0,169]
[null,1972,"HAKAO ROAD",0,703]
[null,1582,"HALL ROAD",0,350]
[null,1264,"HAMURANA ROAD",0,1378]
[null,7192,"HAMURANA ROAD/COPPELIA AVENUE RAB",0,56]
[null,1852,"HANGA ROAD",0,2071]
[null,1004,"HANLEN AVENUE",0,570]
[null,1862,"HANSEN PLACE",0,62]
[null,1274,"HARBOUR VIEW ROAD",0,1208]
[null,1046,"HARBOUR VIEW ROAD (ONGARE POINT)",0,271]
[null,7210,"HARBOUR VIEW ROAD EXTENSION",0,39]
[null,7228,"HARBOUR VIEW ROAD HLA (#29-33)",0,45]
[null,7227,"HARBOUR VIEW ROAD SLIP #1",0,23]
[null,1698,"HARPER WAY",0,25]
[null,1616,"HARRAY ROAD",0,2739]
[null,1788,"HARRIS STREET",0,515]
[null,1758,"HASTINGS STREET",0,224]
[null,1842,"HAYWARD COURT",0,289]
[null,1214,"HAYWARD ROAD",0,197]
[null,1168,"HEARTWOOD AVENUE",0,499]
[null,94022,"HEARTWOOD AVENUE/TE RINA BOULEVARD RAB",0,48]
[null,1109,"HENRY ROAD (EAST)",0,590]
[null,7,"HENRY ROAD (WEST)",0,1635]
[null,4020,"HENRY ROAD SLIP (RP 118 RHS)",0,50]
[null,1757,"HERBERT STREET",0,153]
[null,1667,"HEREFORD PARK ROAD",0,3955]
[null,1856,"HEREFORD PLACE",0,195]
[null,1473,"HEREFORD ROAD",0,4082]
[null,1102,"HERON CRESCENT",0,295]
[null,1258,"HERRING PLACE",0,87]
[null,1098,"HIGHFIELDS DRIVE",0,962]
[null,1040,"HIKURANGI ROAD",0,584]
[null,1826,"HILLARY STREET",0,111]
[null,1823,"HILLVIEW ROAD",0,590]
[null,1968,"HINCKLEY ROAD",0,74]
[null,1804,"HINEMOA ROAD",0,177]
[null,1960,"HOGGARD PLACE",0,188]
[null,1948,"HOLYOAKE TERRACE",0,371]
[null,1510,"HOMEWOOD DRIVE",0,860]
[null,1761,"HOOKEY DRIVE",0,609]
[null,1124,"HOT SPRINGS ROAD",0,5327]
[null,1157,"HUME ROAD",0,747]
[null,1711,"HURIANA CRESCENT",0,300]
[null,1522,"HUSE LANE",0,1025]
[null,1086,"HYDE STREET",0,311]
[null,1967,"IAN PLACE",0,282]
[null,1215,"I'ANSON ROAD",0,837]
[null,1865,"IONA DRIVE",0,513]
[null,1067,"IRWIN COURT",0,94]
[null,1885,"ISLAND VISTA",0,115]
[null,1471,"JACKS LANE",0,410]
[null,1242,"JAMES ROAD",0,734]
[null,1812,"JENKINSON STREET",0,276]
[null,1681,"JENSEN ROAD",0,1963]
[null,1438,"JENSEN ROAD (OMANAWA)",0,993]
[null,1221,"JESS ROAD",0,1265]
[null,1783,"JOCELYN STREET",0,616]
[null,1099,"JOCELYN STREET (KATIKATI)",0,215]
[null,7217,"JOCELYN STREET SERVICE LANE (RP 236 RHS)",0,221]
[null,7200,"JOCELYN STREET/QUEEN STREET RAB",0,61]
[null,1511,"JOHN BIRD ROAD",0,761]
[null,1666,"JOHNSON ROAD",0,3377]
[null,1254,"JOSEPHINE PLACE",0,65]
[null,1345,"JOYCE ROAD",0,6150]
[null,1309,"JUNCTION ROAD",0,2699]
[null,1271,"KAHAROA AVENUE",0,148]
[null,1225,"KAHAWAI PLACE",0,290]
[null,1922,"KAIATE FALLS ROAD",0,2030]
[null,1923,"KAIAWHA ROAD",0,412]
[null,1543,"KAIKOKOPU ROAD",0,2941]
[null,7146,"KAIMAI LANE",0,100]
[null,1353,"KAITEMAKO ROAD",3786,6680]
[null,1479,"KAITEMAKO ROAD SOUTH",0,1104]
[null,1513,"KAITUNA RIVER ROAD",0,3450]
[null,1533,"KAITUNA ROAD",0,6308]
[null,1368,"KAIWHA ROAD",0,855]
[null,1525,"KARNER DRIVE",0,554]
[null,1106,"KATTERNS STREET",0,173]
[null,1133,"KAURI LANE",0,284]
[null,1556,"KAURI PLACE",0,170]
[null,7035,"KAURI PLACE EXTN",0,30]
[null,1054,"KAURI POINT ROAD",0,5393]
[null,1259,"KAYELENE PLACE",0,1394]
[null,1103,"KEA STREET",0,380]
[null,1527,"KELLY ROAD",0,2846]
[null,12,"KEMURETI STREET",0,190]
[null,1512,"KENANA ROAD",0,1275]
[null,1475,"KENSINGTON LANE",0,170]
[null,1735,"KILLARNEY STREET",0,107]
[null,1123,"KILLEN ROAD",0,525]
[null,1793,"KING STREET",0,416]
[null,1334,"KINGSON COURT",0,47]
[null,1562,"KIOKIO PLACE",0,144]
[null,1905,"KIRI PLACE",0,71]
[null,1167,"KNYVETT ROAD",0,355]
[null,1287,"KOHERU PLACE",0,96]
[null,1363,"KORORA CRESCENT",0,286]
[null,7108,"KOTAHI LANE",0,257]
[null,1010,"KOUTUNUI ROAD",0,1398]
[null,1272,"KOWAI GROVE",0,134]
[null,1742,"KOWHAI AVENUE",0,161]
[null,1073,"KOWHAI COURT",0,174]
[null,1360,"KUAKA RISE",0,133]
[null,1238,"KUKA ROAD",0,412]
[null,1300,"KUMIKUMI ROAD",0,2245]
[null,1898,"KYBER PASS",0,82]
[null,1767,"KYLEMORE PLACE",0,64]
[null,1974,"LAKESIDE TERRACE",0,397]
[null,1148,"LANCASTER ROAD",0,953]
[null,1728,"LANDSCAPE ROAD",0,323]
[null,4036,"LANDSCAPE ROAD SLIP",0,117]
[null,1901,"LANSDOWNE ROAD",0,210]
[null,1291,"LAUREL DRIVE",0,800]
[null,1451,"LAWRY LANE",0,806]
[null,1189,"LAYLA PLACE",0,148]
[null,1789,"LEE STREET",0,374]
[null,1581,"LEMON ROAD",0,427]
[null,1729,"LENIHAN DRIVE",0,155]
[null,1817,"LEO STREET",0,361]
[null,7339,"LEONARD WAY",0,42]
[null,1070,"LEVLEY LANE",0,658]
[null,1294,"LEYLAND ROAD",0,1501]
[null,1063,"LINDEMANN ROAD",0,3491]
[null,1231,"LINDOCH AVENUE",0,152]
[null,1260,"LINKS VIEW DRIVE",0,715]
[null,7043,"LINKS VIEW DRIVE SLIP",0,82]
[null,1873,"LISMORE LANE",0,197]
[null,1554,"LITTLE WAIHI ROAD",0,1354]
[null,1874,"LLOYDS LANE",0,453]
[null,1241,"LOCHHEAD ROAD",0,1695]
[null,1140,"LOCKINGTON ROAD",0,5215]
[null,1928,"LONGBOARD DRIVE",0,150]
[null,1918,"LONGMYND DRIVE",0,549]
[null,1253,"LOOP ROAD",0,492]
[null,1188,"LOWE ROAD",0,636]
[null,1490,"LOWRY ROAD",0,491]
[null,1917,"LUDLOW PLACE",0,122]
[null,1132,"LUND ROAD",0,5218]
[null,1567,"LYNDHURST AVENUE",0,361]
[null,1947,"LYNLEY PARK DRIVE",0,1155]
[null,7000,"LYNLEY PARK DRIVE/HOLYOAKE TERRACE RAB",0,58]
[null,7292,"LYNLEY PARK DRIVE/LAKESIDE TERRACE RAB",0,55]
[null,1662,"MACDOUGALL QUARRY ROAD",0,3262]
[null,1732,"MACLOUGHLIN DRIVE",0,873]
[null,1097,"MACMILLAN STREET",0,194]
[null,1031,"MADELEINE PLACE",0,50]
[null,1791,"MAGNOLIA PLACE",0,64]
[null,1083,"MAJOR STREET",0,70]
[null,1528,"MAKETU ROAD",0,6892]
[null,7165,"MAKETU ROAD/PARK ROAD RAB",0,60]
[null,1001,"MAKO AVENUE",0,143]
[null,1524,"MALCOLM AVENUE",0,662]
[null,1786,"MALYON STREET",0,219]
[null,1687,"MANAWAHE ROAD",0,1416]
[null,1675,"MANGATOI ROAD",0,9390]
[null,1976,"MANGAWHAI PLACE",0,41]
[null,1969,"MANIAROA DRIVE",0,340]
[null,1542,"MANIATUTU ROAD",0,18180]
[null,1492,"MANOEKA ROAD",0,5410]
[null,1266,"MARGARET DRIVE",0,1058]
[null,1016,"MARINA WAY",0,142]
[null,1808,"MARINE AVENUE",0,228]
[null,1633,"MARK ROAD",0,2210]
[null,1006,"MARLIN AVENUE",0,128]
[null,1110,"MARSHALL PLACE",0,110]
[null,1111,"MARSHALL ROAD",0,745]
[null,1292,"MARTHA LANE",0,342]
[null,1044,"MARTRAY ROAD",0,1412]
[null,1424,"MARUIA PLACE",0,193]
[null,1229,"MATAHIWI ROAD",0,291]
[null,1146,"MATAHUI ROAD",0,4660]
[null,1693,"MATAKANA POINT ROAD",0,1840]
[null,1695,"MATAKANA ROAD",0,4159]
[null,1849,"MATHERS ROAD",0,2923]
[null,1392,"MATUKU PLACE",0,138]
[null,1639,"MAUNGARANGI ROAD",0,11437]
[null,1813,"MAYOR VIEW TERRACE",0,596]
[null,7209,"MAYOR VIEW TERRACE SIDE ROAD",0,45]
[null,1774,"MCBETH DRIVE",0,233]
[null,1276,"MCDONNELL STREET",0,254]
[null,7308,"MCDONNELL STREET CARPARK",0,29]
[null,1838,"MCINTOSH ROAD",0,1225]
[null,1925,"MCKENNA LANE",0,83]
[null,1538,"MCKENZIE ROAD",0,599]
[null,1429,"MCLAREN FALLS ROAD",0,9625]
[null,1042,"MCMILLAN ROAD",0,796]
[null,1481,"MCPHAIL ROAD",0,3975]
[null,1288,"MCQUADE ROAD",0,114]
[null,1454,"MELVILLE ROAD",0,448]
[null,1572,"MENDS LANE",0,193]
[null,1944,"MERMAID PLACE",0,58]
[null,1457,"MERRICK ROAD",0,1653]
[null,1876,"MICKELLS DRIVE",0,60]
[null,1959,"MIDDLEBROOK DRIVE",0,804]
[null,1910,"MIDLAND LANE",0,296]
[null,1647,"MILFORD PARK DRIVE",0,1210]
[null,1846,"MILSOM PLACE",0,157]
[null,1301,"MINDEN ROAD",0,6790]
[null,1036,"MOANA DRIVE",0,318]
[null,1766,"MOEHAU STREET",0,705]
[null,1150,"MORTON ROAD",0,1551]
[null,1610,"MOUNTAIN ROAD",0,7173]
[null,1797,"MOUNTBATTEN PLACE",0,106]
[null,1183,"MOUNTIER ROAD",0,650]
[null,1741,"MUIR PLACE",0,134]
[null,1934,"MUIRFIELD CRESCENT",0,216]
[null,1075,"MULGAN STREET",0,495]
[null,1216,"MUNRO ROAD",0,1833]
[null,1307,"MUNRO ROAD EAST",0,216]
[null,1377,"MURAL DRIVE",0,73]
[null,7371,"MURAL DRIVE LOOP",0,419]
[null,1280,"MYRTLE DRIVE",0,281]
[null,1650,"MYSTERY VALLEY ROAD",0,2806]
[null,1657,"NANRIC LANE",0,490]
[null,1013,"NATHAN PLACE",0,52]
[null,1476,"NEEWOOD ROAD",0,794]
[null,1739,"NETTLINGHAM PLACE",0,79]
[null,1222,"NEWNHAM ROAD",0,486]
[null,1970,"NGA PARAE ROAD",0,174]
[null,1425,"NGAMUWAHINE ROAD",0,3405]
[null,1564,"NGAPARAOA DRIVE",0,272]
[null,1504,"NO 1 ROAD",0,8865]
[null,7238,"NO 1 ROAD HLA",0,78]
[null,1502,"NO 2 ROAD",0,21101]
[null,1497,"NO 3 ROAD",0,13834]
[null,1491,"NO 4 ROAD",0,7466]
[null,1946,"NOBLE JOHNSTON DRIVE",0,368]
[null,1053,"NOBLE LANE",0,92]
[null,1977,"NOLAN PLACE",0,160]
[null,1904,"NORM FREEMAN DRIVE",0,674]
[null,1055,"NORON PLACE",0,231]
[null,1760,"NORRIE STREET",0,266]
[null,1174,"NORTH ROAD",0,794]
[null,1370,"NOTTINGHAM ROAD",0,122]
[null,1636,"OAK DRIVE",0,758]
[null,1943,"OCEAN BREEZE DRIVE",0,560]
[null,7307,"OCEAN BREEZE DRIVE EXTENSION",0,38]
[null,1810,"OCEAN VIEW ROAD",0,676]
[null,1295,"ODEY ROAD",0,1090]
[null,1660,"OHINEPANEA ROAD",0,2088]
[null,1240,"OIKIMOKE ROAD",0,562]
[null,1586,"OLD COACH ROAD",0,22748]
[null,7155,"OLD COACH ROAD SLIP",0,43]
[null,1187,"OLD HIGHWAY",0,5715]
[null,1587,"OLD KAIMAI ROAD",0,5752]
[null,1912,"OLD TAURANGA ROAD",0,200]
[null,1949,"OLIVE CLOSE",0,138]
[null,1322,"OLIVER ROAD",0,1489]
[null,1439,"OMANAWA ROAD",0,17494]
[null,1207,"OMOKOROA ROAD",0,5223]
[null,7226,"OMOKOROA ROAD HLA (#24-#38)",0,104]
[null,7191,"OMOKOROA ROAD HLA (#64-72)",0,93]
[null,7225,"OMOKOROA ROAD HLA (#74-80)",0,63]
[null,7286,"OMOKOROA ROAD/KAYELENE PLACE RAB",0,83]
[null,7410,"OMOKOROA ROAD/MCKENNA LANE RAB",0,52]
[null,7334,"OMOKOROA ROAD/RIDGE DRIVE RAB",0,86]
[null,7193,"OMOKOROA ROAD/TRALEE STREET RAB",0,73]
[null,7287,"OMOKOROA ROAD/WESTERN AVENUE RAB",0,91]
[null,1045,"ONGARE POINT ROAD",0,2969]
[null,7363,"OPOU PLACE",0,139]
[null,1694,"OPUHI ROAD",0,920]
[null,1697,"OPUREORA ROAD",0,1849]
[null,1591,"ORMSBY LANE",0,420]
[null,1469,"OROPI GORGE ROAD",0,5228]
[null,1347,"OROPI ROAD",2157,18359]
[null,7239,"OROPI ROAD HLA (#1315 - #1325)",0,133]
[null,1753,"OROUA STREET",0,282]
[null,7117,"OROUA STREET EXTN (RP198 RHS)",0,50]
[null,1663,"OTAMARAKAU VALLEY ROAD",0,7094]
[null,1780,"OTAWA STREET",0,155]
[null,1557,"OTIMI STREET",0,289]
[null,1832,"OTTO ROAD",0,152]
[null,1889,"OWEN PLACE",0,390]
[null,1779,"OXFORD STREET",0,700]
[null,7352,"OYSTER PLACE",0,220]
[null,1703,"PAAMA COURT",0,62]
[null,1803,"PACIFIC ROAD",0,207]
[null,3,"PAH ROAD (NORTH)",0,1255]
[null,1518,"PAH ROAD (SOUTH)",0,5194]
[null,1204,"PAHOIA BEACH ROAD",0,470]
[null,1185,"PAHOIA ROAD",0,3345]
[null,1931,"PALM GROVE",0,151]
[null,1798,"PALMER PLACE",0,69]
[null,1246,"PAPAROA ROAD",0,620]
[null,1022,"PAPAUNAHI ROAD",0,682]
[null,1818,"PARK AVENUE",0,110]
[null,1763,"PARK LANE (TE PUKE)",0,51]
[null,1233,"PARK LANE (TE PUNA)",0,206]
[null,1066,"PARK ROAD (KATIKATI)",0,1905]
[null,1553,"PARK ROAD (MAKETU)",0,110]
[null,1963,"PARKLAND RISE",0,122]
[null,1248,"PARORE DRIVE",0,64]
[null,1387,"PARTON ROAD",0,1259]
[null,1642,"PARTRIDGE LANE",0,444]
[null,1374,"PATIKI PLACE",0,69]
[null,1833,"PATTERSON PLACE",0,108]
[null,1448,"PEERS ROAD",0,3304]
[null,1726,"PENDEREL ROAD",0,835]
[null,1575,"PENELOPE PLACE",0,262]
[null,1427,"PENMORAL LANE",0,451]
[null,1430,"PERKINS DRIVE",0,268]
[null,1081,"PHILIP WALTER DRIVE",0,188]
[null,4039,"PIKIRANGI ROAD",0,229]
[null,1156,"PINE RIDGE LANE",0,865]
[null,1020,"PIO ROAD",0,531]
[null,7356,"PIO ROAD SERVICE LANE (RP25 LHS)",0,38]
[null,7365,"PIONEER CRESCENT",0,292]
[null,1330,"PIP WAY",0,91]
[null,1239,"PITUA ROAD",0,627]
[null,1971,"PLOM ROAD",0,182]
[null,1200,"PLUMMER ROAD",0,1100]
[null,1210,"PLUMMERS POINT ROAD",0,4047]
[null,1012,"POHUTUKAWA DRIVE",0,503]
[null,1580,"POKARE ROAD",0,342]
[null,1088,"POLLEY CRESCENT",0,348]
[null,1655,"PONGAKAWA BUSH ROAD",0,14954]
[null,1651,"PONGAKAWA SCHOOL ROAD",0,1430]
[null,1652,"PONGAKAWA STATION ROAD",0,2973]
[null,1683,"PONGAKAWA VALLEY ROAD",0,3491]
[null,1384,"POPLAR LANE",0,614]
[null,1310,"PORIPORI ROAD",0,6269]
[null,7141,"POST OFFICE ROAD (MATAKANA)",0,73]
[null,1047,"POTU ROAD",0,185]
[null,1151,"PRESTIDGE ROAD",0,1842]
[null,1952,"PRESTON DRIVE",0,302]
[null,7270,"PRESTON DRIVE LOOP",0,71]
[null,1051,"PRINCES STREET",0,378]
[null,1744,"PRINCESS STREET",0,252]
[null,1206,"PROLE ROAD",0,1514]
[null,1158,"PROSPECT DRIVE",0,403]
[null,1680,"PUGH ROAD",0,1825]
[null,1159,"PUKAKURA ROAD",0,1440]
[null,1573,"PUKEHINA BEACH ROAD",0,3504]
[null,7004,"PUKEHINA BEACH ROAD EXTENSION",0,71]
[null,1576,"PUKEHINA PARADE",0,5197]
[null,1656,"PUKEHINA STATION ROAD",0,3356]
[null,1349,"PUKEMAPU ROAD",425,2221]
[null,1745,"PURIRI AVENUE",0,188]
[null,1751,"QUEEN STREET",0,1013]
[null,7144,"QUEEN STREET (EASTBOUND)",0,204]
[null,1820,"QUEEN STREET (WAIHI BEACH)",0,177]
[null,7027,"QUEEN STREET/BOUCHER AVENUE RAB",0,93]
[null,1958,"RALPH LANE",0,229]
[null,1776,"RANDELL PLACE",0,171]
[null,1521,"RANGIURU ROAD",0,16313]
[null,1232,"RARAPUA PLACE",0,398]
[null,1619,"RATAHA LANE",0,466]
[null,1547,"RAUPOROA ROAD",0,163]
[null,1116,"RAWAKA DRIVE",0,594]
[null,1737,"RAYMOND AVENUE",0,401]
[null,1122,"REA ROAD",0,3420]
[null,1920,"REABROOK PLACE",0,94]
[null,1942,"REEL ROAD",0,637]
[null,1635,"REEVES ROAD",0,420]
[null,1376,"REID ROAD",0,5690]
[null,7206,"REID ROAD SOUTH",0,583]
[null,1929,"REO CRESCENT",0,166]
[null,1136,"REREATUKAHIA ROAD",0,264]
[null,1202,"RICHARDSON ROAD",0,210]
[null,7364,"RICHARDSON ROAD/NOTTINGHAM ROAD RAB",0,29]
[null,1622,"RIDDELL ROAD",0,396]
[null,1195,"RIDGE DRIVE",0,873]
[null,7329,"RIDGE DRIVE/STINGRAY DRIVE RAB",0,52]
[null,1679,"RIDGE ROAD",0,5609]
[null,1071,"RIVERLEA DRIVE",0,184]
[null,1965,"RIVERSIDE PLACE",0,180]
[null,1104,"ROBINSON STREET",0,255]
[null,1373,"ROCKY CUTTING ROAD",0,4849]
[null,1505,"RODERICK LANE",0,977]
[null,1579,"ROGERS ROAD",0,1363]
[null,1059,"RONALDS LANE",0,105]
[null,1018,"RORETANA DRIVE",0,585]
[null,1069,"ROSEMARY PLACE",0,89]
[null,1290,"ROSS ROAD",0,3254]
[null,1897,"ROSS WARE DRIVE",0,297]
[null,1664,"ROTOEHU ROAD",0,17654]
[null,1477,"ROWE ROAD",0,4647]
[null,1649,"ROYDON DOWNS ROAD",0,6835]
[null,1434,"RUAHIHI ROAD",0,2700]
[null,1278,"RUAMOANA PLACE",0,202]
[null,2278,"RUAMOANA PLACE EXTENSION",0,71]
[null,3278,"RUAMOANA PLACE EXTN HAMMERHEAD",0,204]
[null,1361,"RURU PLACE",0,186]
[null,1909,"SAGEWOOD ROAD",0,557]
[null,1907,"SAMANTHA PLACE",0,81]
[null,1956,"SANDLEIGH DRIVE",0,186]
[null,1328,"SANDY PLACE",0,138]
[null,7273,"SAPPHIRE SPRINGS ROAD",0,328]
[null,1875,"SARGENT DRIVE",0,200]
[null,1765,"SAUNDERS PLACE",0,161]
[null,1806,"SAVAGE AVENUE",0,232]
[null,1815,"SCARBOROUGH ROAD",0,194]
[null,1669,"SCHRIEBER ROAD",0,1547]
[null,1824,"SCOTT STREET",0,119]
[null,1881,"SEA CREST PLACE",0,117]
[null,1886,"SEA VISTA",0,144]
[null,1957,"SEAFOAM PLACE",0,126]
[null,1000,"SEAFORTH ROAD",0,7109]
[null,7202,"SEAFORTH ROAD/EMERTON ROAD RAB",0,56]
[null,7201,"SEAFORTH ROAD/PIO ROAD RAB",0,60]
[null,7048,"SEAFORTH SLIP ROAD #1 (RP5356 LHS)",0,144]
[null,7049,"SEAFORTH SLIP ROAD #2 (RP5570 LHS)",0,245]
[null,7050,"SEAFORTH SLIP ROAD #3 (RP5886 LHS)",0,174]
[null,7177,"SEAFORTH SLIP ROAD #4 (RP6146 RHS)",0,126]
[null,1608,"SEALES ROAD",0,844]
[null,1801,"SEAVIEW ROAD",0,214]
[null,1501,"SEDDON STREET",0,1119]
[null,1134,"SEDGEMOOR LANE",0,378]
[null,1128,"SENTINEL AVENUE",0,710]
[null,7357,"SENTINEL AVENUE/SETTLER AVENUE RAB",0,40]
[null,1314,"SERENITY DRIVE",0,304]
[null,1058,"SETTLER AVENUE",0,92]
[null,1354,"SHADY LANE",0,639]
[null,1137,"SHARP ROAD",0,3294]
[null,1621,"SHAW ROAD (TE PUKE)",0,630]
[null,1822,"SHAW ROAD (WAIHI BEACH)",0,899]
[null,1618,"SHEARER ROAD",0,381]
[null,1112,"SHEFFIELD STREET",0,323]
[null,1993,"SHOREVIEW CLOSE",0,103]
[null,1606,"SHOWGROUND ROAD",0,860]
[null,1916,"SHREWSBURY PLACE",0,236]
[null,1201,"SINCLAIR ROAD",0,604]
[null,1754,"SLATER PLACE",0,126]
[null,7236,"SLATER PLACE SERVICE LANE (RP33 RHS)",0,155]
[null,1834,"SNELL CRESCENT",0,562]
[null,1218,"SNODGRASS ROAD",0,4010]
[null,1426,"SOLDIERS ROAD",0,5753]
[null,1559,"SPENCER AVENUE (EAST)",0,451]
[null,11,"SPENCER AVENUE (WEST)",0,211]
[null,1050,"STANLEY STREET",0,93]
[null,1784,"STATION ROAD (TE PUKE)",0,1143]
[null,1026,"STEELE ROAD",0,1450]
[null,1175,"STEWART ROAD",0,1995]
[null,1084,"STEWART STREET (KATIKATI)",0,100]
[null,1782,"STEWART STREET (TE PUKE)",0,215]
[null,1226,"STINGRAY DRIVE",0,323]
[null,1799,"STOCK ROAD",0,179]
[null,1665,"STOCKTON ROAD",0,1550]
[null,1060,"STOKES ROAD",0,135]
[null,1520,"STRANG ROAD",0,450]
[null,1872,"STRATHAVEN WAY",0,61]
[null,1143,"STRATHMORE DRIVE",0,455]
[null,1585,"SUNSET DRIVE",0,273]
[null,1940,"SURFERS AVENUE",0,314]
[null,1569,"TAINUI ROAD",0,3125]
[null,1924,"TALISMAN DRIVE",0,214]
[null,1236,"TANGITU ROAD",0,1381]
[null,1035,"TANNERS POINT ROAD",0,2056]
[null,1530,"TAPSELL ROAD",0,869]
[null,1023,"TATAI ROAD",0,244]
[null,1599,"TAUMATA ROAD",0,11056]
[null,1540,"TAUPATA ROAD",0,565]
[null,1552,"TE AWHE ROAD",0,424]
[null,1859,"TE KAHIKA ROAD",0,650]
[null,1196,"TE KAKA PLACE",0,179]
[null,1882,"TE KANAWA PLACE",0,117]
[null,1220,"TE KARAKA DRIVE",0,86]
[null,1913,"TE KOHANGA ROAD",0,1024]
[null,1508,"TE MATAI ROAD",0,27563]
[null,1324,"TE METE ROAD",0,259]
[null,7302,"TE PUKE HIGHWAY",0,17521]
[null,1340,"TE PUKE HIGHWAY (WESTBOUND)",0,761]
[null,7297,"TE PUKE HIGHWAY HLA (RP10436 RHS)",0,39]
[null,7218,"TE PUKE HIGHWAY SERVICE LANE (RP9949 LHS)",0,74]
[null,7174,"TE PUKE HIGHWAY SLIP (RP10445 LHS)",0,155]
[null,10,"TE PUKE HIGHWAY/BOUCHER AVENUE RAB",0,63]
[null,5,"TE PUKE HIGHWAY/JOCELYN STREET RAB",0,100]
[null,8,"TE PUKE HIGHWAY/NO 3 ROAD RAB",0,50]
[null,6,"TE PUKE HIGHWAY/OXFORD STREET RAB",0,78]
[null,9,"TE PUKE HIGHWAY/TE PUKE QUARRY ROAD RAB",0,50]
[null,7353,"TE PUKE HIGHWAY/WELCOME BAY ROAD RAB",0,152]
[null,1488,"TE PUKE QUARRY ROAD",0,7968]
[null,1305,"TE PUNA QUARRY ROAD",0,1131]
[null,1243,"TE PUNA ROAD",0,3273]
[null,1247,"TE PUNA STATION ROAD",0,3305]
[null,1286,"TE TUHI TRACK ROAD",0,844]
[null,1526,"TE TUMU ROAD",0,3677]
[null,1311,"TEBBUTT ROAD",0,1417]
[null,1252,"TEIHANA ROAD",0,772]
[null,1115,"TETLEY ROAD",0,2390]
[null,1831,"THE CRESCENT",0,765]
[null,1273,"THE ESPLANADE (OMOKOROA)",0,590]
[null,1805,"THE ESPLANADE (WAIHI BEACH)",0,64]
[null,1835,"THE LOOP",0,557]
[null,1802,"THE TERRACE",0,142]
[null,1126,"THOMAS ROAD NORTH",0,297]
[null,4012,"THOMAS ROAD SOUTH",0,89]
[null,1138,"THOMPSONS TRACK",0,5671]
[null,1428,"THORN ROAD",0,626]
[null,4041,"THORN ROAD SLIP",0,75]
[null,1119,"THORNTON ROAD",0,144]
[null,1199,"TIM ROAD",0,3095]
[null,1914,"TIMON DRIVE",0,415]
[null,1267,"TINOPAI DRIVE",0,203]
[null,7229,"TINOPAI DRIVE HLA (#10-16)",0,74]
[null,1692,"TIROHANGA ROAD",0,1616]
[null,1945,"TOHORA VIEW",0,361]
[null,1927,"TOM BAIKIE LANE",0,147]
[null,1432,"TOMSETT ROAD",0,1250]
[null,1549,"TOWN POINT ROAD",0,1188]
[null,94021,"TOWN POINT ROAD HLA (#85A-97)",0,131]
[null,1265,"TRALEE STREET",0,173]
[null,1979,"TRANQUIL GROVE",0,119]
[null,7316,"TRANQUIL GROVE LOOP",0,78]
[null,1117,"TRAVERSE LANE",0,313]
[null,1244,"TREHOLME LANE",0,131]
[null,1937,"TROON DRIVE",0,134]
[null,1906,"TROY PLACE",0,52]
[null,1041,"TUAPIRO ROAD",0,4400]
[null,7299,"TUAPIRO ROAD CARPARK",0,539]
[null,1860,"TUHUA PLACE",0,194]
[null,1999,"TUI GLEN",0,187]
[null,1101,"TUI PLACE",0,269]
[null,1748,"TUI STREET",0,505]
[null,1005,"TUNA AVENUE",0,88]
[null,1938,"TURNBERRY CLOSE",0,280]
[null,1155,"TURNER ROAD",0,1528]
[null,1184,"TURNTABLE HILL ROAD",0,1028]
[null,1646,"TUTEA PLACE",0,141]
[null,1899,"TWICKENHAM CLOSE",0,112]
[null,1982,"TYE ROAD",0,419]
[null,1772,"TYNAN STREET",0,860]
[null,1165,"UPLAND ROAD",0,2452]
[null,1352,"UPPER OHAUITI ROAD",3794,15446]
[null,1900,"URETARA DRIVE",0,106]
[null,7240,"URETARA DRIVE HAMMERHEAD",0,363]
[null,1316,"VALABRINA DRIVE",0,158]
[null,1733,"VALLEY ROAD",0,524]
[null,1589,"VALLEY VIEW ROAD",0,602]
[null,1973,"VANTAGE PLACE",0,93]
[null,1317,"VERNON ROAD",0,760]
[null,1052,"VICTORIA STREET",0,162]
[null,1275,"VIVIAN DRIVE",0,421]
[null,1568,"WAERENGA ROAD",0,1459]
[null,1085,"WAI HURI PLACE",0,157]
[null,1299,"WAIATA ROAD",0,235]
[null,1028,"WAIAU ROAD",0,1104]
[null,1809,"WAIHI BEACH ROAD",0,2969]
[null,1696,"WAIHIRERE ROAD",0,1330]
[null,1009,"WAIITI AVENUE",0,78]
[null,1235,"WAIKARAKA DRIVE EAST",0,164]
[null,1234,"WAIKARAKA DRIVE WEST",0,430]
[null,1634,"WAIMEA DRIVE",0,1655]
[null,1181,"WAINUI SOUTH ROAD",0,5587]
[null,1017,"WAIONE AVENUE",0,300]
[null,1237,"WAIPA ROAD",0,405]
[null,1198,"WAIPAPA BLOCK ROAD",0,2354]
[null,1995,"WAIRERE RISE",0,194]
[null,7215,"WAIROA RIVER RESERVE",0,384]
[null,1325,"WAIROA ROAD",0,3714]
[null,1921,"WAITAHA ROAD SOUTH",0,425]
[null,1661,"WAITAHANUI LANE",0,215]
[null,1369,"WAITAO ROAD",0,8896]
[null,1021,"WAKANOI PLACE",0,231]
[null,1877,"WALDEN LANE",0,511]
[null,1166,"WALFORD ROAD",0,2306]
[null,1141,"WALKER ROAD EAST",0,2648]
[null,1142,"WALKER ROAD WEST",0,449]
[null,1230,"WALLACE ROAD",0,637]
[null,1807,"WALLNUTT AVENUE",0,227]
[null,1279,"WALNUT GROVE",0,123]
[null,1908,"WALTER HENRY DRIVE",0,739]
[null,1472,"WARNER ROAD",0,2382]
[null,1759,"WASHER PLACE",0,205]
[null,1500,"WASHER ROAD",0,665]
[null,1870,"WATERVIEW TERRACE",0,190]
[null,7101,"WEDGEWOOD LANE",0,163]
[null,7148,"WEDGEWOOD PLACE",0,56]
[null,1108,"WEDGEWOOD STREET",0,250]
[null,1356,"WELCOME BAY ROAD",0,8185]
[null,1800,"WEST STREET",0,77]
[null,1145,"WESTBANK DRIVE",0,170]
[null,1262,"WESTERN AVENUE",0,922]
[null,1029,"WESTWOOD ROAD",0,123]
[null,1212,"WHAKAMARAMA ROAD",0,10514]
[null,1118,"WHARAWHARA ROAD",0,4227]
[null,1571,"WHARERE ROAD",0,3938]
[null,1676,"WHATAROA ROAD",0,7780]
[null,1563,"WHENUARIRI PLACE",0,187]
[null,7034,"WHENUARIRI PLACE SLIP",0,73]
[null,1499,"WHITEHEAD AVENUE",0,682]
[null,1933,"WILLIAM WOOD PLACE",0,109]
[null,1548,"WILLIAMS CRESCENT",0,311]
[null,1768,"WILLIAMS DRIVE",0,167]
[null,1600,"WILLIAMS ROAD",0,805]
[null,1463,"WILLIAMS ROAD NORTH",0,2347]
[null,1465,"WILLIAMS ROAD SOUTH",0,561]
[null,1061,"WILLOUGHBY ROAD",0,2602]
[null,1096,"WILLS ROAD",0,1066]
[null,1827,"WILSON ROAD (WAIHI BEACH)",0,1075]
[null,1537,"WILSON ROAD NORTH",0,6547]
[null,7224,"WILSON ROAD SERVICE LANE (RP814 RHS)",0,57]
[null,1539,"WILSON ROAD SOUTH",0,2297]
[null,7156,"WILSON ROAD SOUTH SLIP",0,86]
[null,1778,"WILTSHIRE PLACE",0,118]
[null,1879,"WINDRIDGE LANE",0,830]
[null,1043,"WINROY GROVE",0,576]
[null,1255,"WINSPEAR PLACE",0,124]
[null,1034,"WOLSELEY ROAD",0,745]
[null,1057,"WOODLAND ROAD",0,5735]
[null,1173,"WORK ROAD",0,10358]
[null,1154,"WRIGHT ROAD",0,8465]
[null,1519,"YOUNG ROAD",0,2786]
[null,7175,"YOUNG ROAD SLIP",0,103]
[null,1203,"YOUNGSON ROAD",0,5205]

{"sheet":"LU Drainage","index":34,"n_rows":60,"n_cols":21,"rows_kept":60,"cut":false,"hidden":false,"merged":[]}
["Contents"]
[null,"drain_type_code","drain_type",null,"drain_material_code","drain_material",null,"drain_culvert_code","drain_culvert",null,"drain_entry_code","inlet","outlet",null,"wway",null,"drain_shape_code","drain_shape",null,"flow_direction_code","flow_direction"]
[null,"BO","Bored Drains",null,"ALUM","Aluminium",null,"ARCH","Arched",null,"CP","Catchpit","Catchpit",null,"NONE",null,"O","Oval",null,"N","Not Applicable"]
[null,"CP2","Catchpit - Double",null,"ARMCO","Armco",null,"BOX","Box shaped",null,"DC","Drop Chamber","Drop Chamber",null,"AONGATETE RIVER",null,"R","Round",null,"L","Left"]
[null,"CP3","Catchpit - Side Entry",null,"AC","Asbestos cement",null,"CIRC","Circular",null,"FL","Flume","Flume",null,"BOYD STREAM",null,"S","Square",null,"R","Right"]
[null,"CP1","Catchpit - Single",null,"CON","Concrete",null,"OTHER","Other",null,"G","Yes with a Grating","Yes with a Grating",null,"DRAIN",null,null,null,null,"I","Increasing"]
[null,"CUL","Culvert",null,"EW","Earthenware",null,"TRIBOX","Triple Box",null,"GD","Grid","Grid",null,"DRAIN TO MAKETU ESTUARY",null,null,null,null,"D","Decreasing"]
[null,"DAM","Dam",null,"FAB","Fabric",null,"TRIP_CIRC","Triple Circular",null,"HC","Headwalls (Concrete)","Headwalls (Concrete)",null,"HIKURANGI STREAM"]
[null,"GRID","Debris catching grid",null,"HDPE","H Density Polyethyl",null,"TWIN_ARCH","Twin arched",null,"HG","Headwalls Concrete with Grate","Headwalls Concrete with Grate",null,"KAITEMAKO STREAM"]
[null,"DWELL","Deep well shaft",null,"NG","Natural Ground",null,"TWIN_BOX","Twin boxes",null,"HT","Headwalls (Timber)","Headwalls (Timber)",null,"KAITUNA RIVER"]
[null,"DISS","Dissipation Pad",null,"PVC","Poly Vinyl Chloride",null,"TWIN_CIRC","Twin circular",null,"MH","Manhole","Manhole",null,"KIRIKIRI STREAM"]
[null,"DCHM","Drop Chamber",null,"STEEL","Steel",null,"WATERDRV","Waterdrive (hand dug",null,"N","No","No",null,"KOPUREREUA STREAM"]
[null,"FLUME","Flume down batter",null,"STONE","Stone",null,null,null,null,"OT","Other Structure","Other Structure",null,"LITTLE JOHN'S BRIDGE"]
[null,"EYE","Flushing Eye",null,"WOOD","Timber construction",null,null,null,null,"RC","Rock Wall (Cemented)","Rock Wall (Cemented)",null,"MANGAKARENGORENGO STREAM"]
[null,"MHOLE","Manhole",null,"WILL","Willow saplings/logs",null,null,null,null,"RH","Rock Wall (Hand Placed)","Rock Wall (Hand Placed)",null,"MANGATOETOE STREAM"]
[null,"SCRFD","Manhole with Scruffy Dome",null,null,null,null,null,null,null,"SB","Sandbags","Sandbags",null,"NGUTUTURU STREAM"]
[null,"OTHER","Other",null,null,null,null,null,null,null,"SD","SCRUFFY DOME","SCRUFFY DOME",null,"OEUTEHEUHEU STREAM"]
[null,"OFCUL","Outfall Culvert",null,null,null,null,null,null,null,"TR","Traversable Grate","Traversable Grate",null,"OHINEANGAANGA STREAM"]
[null,"POND","Permanent Silt Pond",null,null,null,null,null,null,null,null,null,null,null,"OHOURERE STREAM"]
[null,"SCOUR","Scour Protection",null,null,null,null,null,null,null,null,null,null,null,"OWAIROA STREAM"]
[null,"SDCUL","Side Culvert",null,null,null,null,null,null,null,null,null,null,null,"PARAHWENUAMEA STREAM"]
[null,"SIDE","Side drain",null,null,null,null,null,null,null,null,null,null,null,"PARAWHENUAMEA STREAM"]
[null,"SP","Soak pit",null,null,null,null,null,null,null,null,null,null,null,"PATIRAWA STREAM"]
[null,"SPILL","Spillway",null,null,null,null,null,null,null,null,null,null,null,"PIAKO STREAM"]
[null,"SUB","Subsoil drain",null,null,null,null,null,null,null,null,null,null,null,"POKOPOKO STREAM"]
[null,"WR","Water Race",null,null,null,null,null,null,null,null,null,null,null,"PONGAKAWA STREAM"]
[null,"WEIR","Weir",null,null,null,null,null,null,null,null,null,null,null,"POUPOU STREAM"]
[null,null,null,null,null,null,null,null,null,null,null,null,null,null,"RAILWAY"]
[null,null,null,null,null,null,null,null,null,null,null,null,null,null,"RAPARAPA HOE STREAM"]
[null,null,null,null,null,null,null,null,null,null,null,null,null,null,"RAPARAPAHOE STREAM"]
[null,null,null,null,null,null,null,null,null,null,null,null,null,null,"STM TOWARD MANGAKARENGORENGO R"]
[null,null,null,null,null,null,null,null,null,null,null,null,null,null,"STREAM FROM BEACH"]
[null,null,null,null,null,null,null,null,null,null,null,null,null,null,"TAHAWAI STREAM"]
[null,null,null,null,null,null,null,null,null,null,null,null,null,null,"TAUPIRO RIVER"]
[null,null,null,null,null,null,null,null,null,null,null,null,null,null,"TAUTA  STREAM"]
[null,null,null,null,null,null,null,null,null,null,null,null,null,null,"TAUTAU STREAM"]
[null,null,null,null,null,null,null,null,null,null,null,null,null,null,"TOROPEKESTREAM"]
[null,null,null,null,null,null,null,null,null,null,null,null,null,null,"TUAPIRO RIVER"]
[null,null,null,null,null,null,null,null,null,null,null,null,null,null,"TUAPIRO STREAM"]
[null,null,null,null,null,null,null,null,null,null,null,null,null,null,"UN-NAMED MINOR TRIBUTARY"]
[null,null,null,null,null,null,null,null,null,null,null,null,null,null,"UN-NAMED TRIBUTARY"]
[null,null,null,null,null,null,null,null,null,null,null,null,null,null,"URETARA STREAM"]
[null,null,null,null,null,null,null,null,null,null,null,null,null,null,"WAIARI STREAM"]
[null,null,null,null,null,null,null,null,null,null,null,null,null,null,"WAIAU RIVER"]
[null,null,null,null,null,null,null,null,null,null,null,null,null,null,"WAIHI STREAM"]
[null,null,null,null,null,null,null,null,null,null,null,null,null,null,"WAIKOURA DRAIN"]
[null,null,null,null,null,null,null,null,null,null,null,null,null,null,"WAIKOURA STREAM"]
[null,null,null,null,null,null,null,null,null,null,null,null,null,null,"WAIMAPU STREAM"]
[null,null,null,null,null,null,null,null,null,null,null,null,null,null,"WAIONE STREAM"]
[null,null,null,null,null,null,null,null,null,null,null,null,null,null,"WAIORAHI STREAM"]
[null,null,null,null,null,null,null,null,null,null,null,null,null,null,"WAIOROHI STREAM"]
[null,null,null,null,null,null,null,null,null,null,null,null,null,null,"WAIPAPA RIVER"]
[null,null,null,null,null,null,null,null,null,null,null,null,null,null,"WAIRAPUKAO STREAM"]
[null,null,null,null,null,null,null,null,null,null,null,null,null,null,"WAIROA RIVER"]
[null,null,null,null,null,null,null,null,null,null,null,null,null,null,"WAITAHANUI STREAM"]
[null,null,null,null,null,null,null,null,null,null,null,null,null,null,"WAITAO STREAM"]
[null,null,null,null,null,null,null,null,null,null,null,null,null,null,"WHAKAHAUPAPA STREAM"]
[null,null,null,null,null,null,null,null,null,null,null,null,null,null,"WHARERE CANAL"]
[null,null,null,null,null,null,null,null,null,null,null,null,null,null,"WHARERE STREAM"]
[null,null,null,null,null,null,null,null,null,null,null,null,null,null,"WHATAKAO STREAM"]

{"sheet":"LU Railings","index":35,"n_rows":32,"n_cols":25,"rows_kept":32,"cut":false,"hidden":false,"merged":[]}
["Contents"]
[null,"railing_type_code","railing_type",null,"railing_make_code","railing_make",null,"shape_code","shape",null,"railing_material_code","railing_material",null,"railing_attach_code","railing_attach",null,"rail_style_code","rail_start_style","rail_end_style",null,"paint_system_code","paint_system",null,"railing_ground_fix_code","railing_ground_fix"]
[null,"CABLE","Cable Barrier",null,"ARM","Armorflex",null,"C","Curved",null,"ARMCO","ARMCO",null,"NA","Not Applicable",null,"ATE","Armorwire Terminal End","Armorwire Terminal End",null,"HDG","Hot Dipped Galvanizing",null,"BRIP","Brifen Concreted Steel Post"]
[null,"FTYPE","F-type Concrete",null,"BRF","Brifen",null,"S","S Bend",null,"CON","Concrete",null,"RD","Reflectorised Disks",null,"BCT","Breakaway Cable Terminal Unit","Breakaway Cable Terminal Unit",null,"MIO","Micaceious Iron oxide",null,"EZYG","Ezy-Guard Z-posts"]
[null,"GR","Guard Rail",null,"CSP","CSP Pacific",null,"T","Straight",null,"EARTH","Earth",null,null,null,null,"BIBS","Buried in Back Slope","Buried in Back Slope",null,"OTH","Other",null,"GP","Ground plant"]
[null,"HR","Hand Rail",null,"IGL","Ingal Civil",null,null,null,null,"GT","Galvanised Rails/Timber Posts",null,null,null,null,"BN","Breakaway Cable Terminal (Bull Nose)","Breakaway Cable Terminal (Bull Nose)",null,"UKN","Unknown",null,"NA","Not Applicable"]
[null,"NJ","New Jersey Barrier",null,"SAF","Safence",null,null,null,null,"GALV","Galvanised Steel",null,null,null,null,"BP","Bridge Plate/Bridge Connector","Bridge Plate/Bridge Connector",null,null,null,null,"NUC","NUCOR (steel)"]
[null,"SR","Sight Rail",null,"TAURN","Tauren Barriers Ltd",null,null,null,null,"PLAST","Plastic",null,null,null,null,"BR","Brifen Terminal","Brifen Terminal",null,null,null,null,"SAFP","Safence Concreted Steel Post"]
[null,"SIBC","Steel Medium Barrier - IBC",null,null,null,null,null,null,null,"PT","Plastic/Timber Posts",null,null,null,null,"CASS","Cable Safety System - CSP","Cable Safety System - CSP",null,null,null,null,"SDM","Steel Driven Post"]
[null,"STP","Steel Tube and Post Barrier",null,null,null,null,null,null,null,"STEEL","Steel",null,null,null,null,"CE","Cable End","Cable End",null,null,null,null,"SPM","Steel Plate Mounted"]
[null,"SWR","Steel Wire Rope Barrier",null,null,null,null,null,null,null,"COMP","Steel Composite",null,null,null,null,"CT350","CAT 350","CAT 350",null,null,null,null,"TP1M","Timber Posts 1 meter intervals"]
[null,"TBGR","THRIE Beam Steel Guard Rail",null,null,null,null,null,null,null,"DRUM","Steel Drum",null,null,null,null,"ELT","Minnesota Eccentric Loader Terminal","Minnesota Eccentric Loader Terminal",null,null,null,null,"TP2M","Timber Posts 2 meter intervals"]
[null,"TRIC","Tric Bloc Concrete Barrier",null,null,null,null,null,null,null,"MESH","Steel Wire Mesh",null,null,null,null,"ET","ET2000","ET2000",null,null,null,null,"TP3M","Timber Posts 3 meter intervals"]
[null,"WGR","W Section Guard Rail",null,null,null,null,null,null,null,"STONE","Stone",null,null,null,null,"FB","Fishtail/Butterfly End","Fishtail/Butterfly End",null,null,null,null,"ZBAR","Zbar"]
[null,null,null,null,null,null,null,null,null,null,"WOOD","Wood",null,null,null,null,"FL350","Fleat 350","Fleat 350"]
[null,null,null,null,null,null,null,null,null,null,null,null,null,null,null,null,"FLMT","Fleat MT","Fleat MT"]
[null,null,null,null,null,null,null,null,null,null,null,null,null,null,null,null,"GREAT","Great System Crash Units","Great System Crash Units"]
[null,null,null,null,null,null,null,null,null,null,null,null,null,null,null,null,"MELT","MELT(Similar to BCT)","MELT(Similar to BCT)"]
[null,null,null,null,null,null,null,null,null,null,null,null,null,null,null,null,"NA","Not Applicable","Not Applicable"]
[null,null,null,null,null,null,null,null,null,null,null,null,null,null,null,null,"QG","Quad Guard","Quad Guard"]
[null,null,null,null,null,null,null,null,null,null,null,null,null,null,null,null,"RE","Regent","Regent"]
[null,null,null,null,null,null,null,null,null,null,null,null,null,null,null,null,"SAF","Safence Terminal","Safence Terminal"]
[null,null,null,null,null,null,null,null,null,null,null,null,null,null,null,null,"SDCC","Steel Drum Crash Cushion","Steel Drum Crash Cushion"]
[null,null,null,null,null,null,null,null,null,null,null,null,null,null,null,null,"SFTST","SoftStop MASH TL3","SoftStop MASH TL3"]
[null,null,null,null,null,null,null,null,null,null,null,null,null,null,null,null,"SK350","SKT 350","SKT 350"]
[null,null,null,null,null,null,null,null,null,null,null,null,null,null,null,null,"SWRA","Steel Wire Rope End Anchor Block","Steel Wire Rope End Anchor Block"]
[null,null,null,null,null,null,null,null,null,null,null,null,null,null,null,null,"TAU2","TAU II","TAU II"]
[null,null,null,null,null,null,null,null,null,null,null,null,null,null,null,null,"TEA","Trailing End Anchor Units","Trailing End Anchor Units"]
[null,null,null,null,null,null,null,null,null,null,null,null,null,null,null,null,"TET","Trailing End Terminal","Trailing End Terminal"]
[null,null,null,null,null,null,null,null,null,null,null,null,null,null,null,null,"TRACC","TR Attenuating Crash Cushion","TR Attenuating Crash Cushion"]
[null,null,null,null,null,null,null,null,null,null,null,null,null,null,null,null,"TT","Texas Twist","Texas Twist"]
[null,null,null,null,null,null,null,null,null,null,null,null,null,null,null,null,"X350","Armorflex X 350","Armorflex X 350"]

{"sheet":"LU Sign","index":36,"n_rows":570,"n_cols":32,"rows_kept":570,"cut":false,"hidden":false,"merged":[]}
["Contents"]
[null,"sign_owner_code","sign_owner",null,"sign_class_code","sign_class",null,"sign_type_code","sign_type","sign_class_code","sign_class",null,"indicating_dir_code","indicating_dir",null,"sign_material_code","legend_material","bground_material",null,"sign_colour_code","legend_colour","bground_colour",null,"replace_reason_code","in_replace_reason","rep_replace_reason",null,"sign_substrate_code","sign_substrate",null,"sign_frame_code","frame"]
[null,"LA","Local Authority",null,"G","Guide",null,"G-ADN","Advance Direction - Street name sign","G",{"$f":"INDEX(sign_class[],MATCH(sign_type[[#This Row],[sign_class_code]],sign_class[sign_class_code],0),2)","v":"Guide"},null,"A","Against",null,"DG","Diamond grade (diamond shape)","Diamond grade (diamond shape)",null,"BK","Black","Black",null,1,"Posts and sign missing","Posts and sign missing",null,"AL","Alumuinium",null,"F","Framed"]
[null,"PR","Private",null,"H","Hazard Markings",null,"G-AD4","Advance direction (Map) - \"\"T\"\" or cross roads","G",{"$f":"INDEX(sign_class[],MATCH(sign_type[[#This Row],[sign_class_code]],sign_class[sign_class_code],0),2)","v":"Guide"},null,"B","Both",null,"EG","Engineering grade (no pattern)","Engineering grade (no pattern)",null,"BR","Brown","Brown",null,10,"Faded","Faded",null,"PL","Plastic",null,"N","Not framed"]
[null,"TN","Transit New Zealand",null,"IG","Information General",null,"G-ADS4","Advance direction (Map) - \"T\" or cross roads","G",{"$f":"INDEX(sign_class[],MATCH(sign_type[[#This Row],[sign_class_code]],sign_class[sign_class_code],0),2)","v":"Guide"},null,"F","For",null,"HI","High intensity (honey comb)","High intensity (honey comb)",null,"BU","Blue","Blue",null,11,"Renewed","Renewed",null,"ST","Steel",null,"U","Unknown"]
[null,"UN","Unknown",null,"IM","Information Miscellaneous",null,"G-ADS5","Advance direction (Map) - Roundabout","G",{"$f":"INDEX(sign_class[],MATCH(sign_type[[#This Row],[sign_class_code]],sign_class[sign_class_code],0),2)","v":"Guide"},null,"L","Left",null,"NR","Non-reflective","Non-reflective",null,"GR","Green","Green",null,12,"Damaged","Damaged",null,"TI","Timber (combination materials)"]
[null,null,null,null,"IMW","Information Motorway",null,"G-AD5","Advance direction (Map) - Roundabout","G",{"$f":"INDEX(sign_class[],MATCH(sign_type[[#This Row],[sign_class_code]],sign_class[sign_class_code],0),2)","v":"Guide"},null,"N","Not applicable",null,"PR","Class 1A Prismatic","Class 1A Prismatic",null,"OR","Orange","Orange",null,13,"Relocated","Relocated",null,"UN","Unknown"]
[null,null,null,null,"I","Information signs",null,"G-AD3","Advance direction (Stack) - \"\"T\"\" intersection","G",{"$f":"INDEX(sign_class[],MATCH(sign_type[[#This Row],[sign_class_code]],sign_class[sign_class_code],0),2)","v":"Guide"},null,"R","Right",null,"UN","Unknown","Unknown",null,"RE","Red","Red",null,2,"Destroyed","Destroyed"]
[null,null,null,null,"LA","Local Authority",null,"G-ADS3","Advance direction (Stack) - \"T\" intersection","G",{"$f":"INDEX(sign_class[],MATCH(sign_type[[#This Row],[sign_class_code]],sign_class[sign_class_code],0),2)","v":"Guide"},null,"S","Side",null,"WA","Wide Observation Area","Wide Observation Area",null,"UN","Unknown","Unknown",null,3,"Unknown","Unknown"]
[null,null,null,null,"M","Miscellaneous",null,"G-ADS1","Advance direction (Stack) - Cross roads","G",{"$f":"INDEX(sign_class[],MATCH(sign_type[[#This Row],[sign_class_code]],sign_class[sign_class_code],0),2)","v":"Guide"},null,"U","Unknown",null,null,null,null,null,"UP","Unpainted","Unpainted",null,4,"Sign only missing","Sign only missing"]
[null,null,null,null,"MS","Motorist Services",null,"G-AD1","Advance direction (Stack) - Cross roads","G",{"$f":"INDEX(sign_class[],MATCH(sign_type[[#This Row],[sign_class_code]],sign_class[sign_class_code],0),2)","v":"Guide"},null,null,null,null,null,null,null,null,"WH","White","White",null,5,"Post only missing","Post only missing"]
[null,null,null,null,"OS","Obsolete signs",null,"G-ADS2","Advance direction (Stack) - Skew intersection","G",{"$f":"INDEX(sign_class[],MATCH(sign_type[[#This Row],[sign_class_code]],sign_class[sign_class_code],0),2)","v":"Guide"},null,null,null,null,null,null,null,null,"YE","Yellow","Yellow",null,6,"Crash Reduction Study","Crash Reduction Study"]
[null,null,null,null,"PW","Permanent Warning",null,"G-AD2","Advance direction (Stack) - Skew intersection","G",{"$f":"INDEX(sign_class[],MATCH(sign_type[[#This Row],[sign_class_code]],sign_class[sign_class_code],0),2)","v":"Guide"},null,null,null,null,null,null,null,null,null,null,null,null,7,"Police Request","Police Request"]
[null,null,null,null,"RG","Regulatory General",null,"G-ADSN","Advance Direction- Street name sign","G",{"$f":"INDEX(sign_class[],MATCH(sign_type[[#This Row],[sign_class_code]],sign_class[sign_class_code],0),2)","v":"Guide"},null,null,null,null,null,null,null,null,null,null,null,null,8,"Graffiti","Graffiti"]
[null,null,null,null,"RH","Regulatory Heavy Vehicle",null,"G-ALDS1","Advanced lane direction - Arrow","G",{"$f":"INDEX(sign_class[],MATCH(sign_type[[#This Row],[sign_class_code]],sign_class[sign_class_code],0),2)","v":"Guide"},null,null,null,null,null,null,null,null,null,null,null,null,9,"NEW","NEW"]
[null,null,null,null,"RP","Regulatory Parking",null,"G-ALDS2","Advanced lane direction - Message","G",{"$f":"INDEX(sign_class[],MATCH(sign_type[[#This Row],[sign_class_code]],sign_class[sign_class_code],0),2)","v":"Guide"},null,null,null,null,null,null,null,null,null,null,null,null,98,"Bylaw Update","Bylaw Update"]
[null,null,null,null,"T","Tourist",null,"G-ALD1","Advanced lane direction [Arrow]","G",{"$f":"INDEX(sign_class[],MATCH(sign_type[[#This Row],[sign_class_code]],sign_class[sign_class_code],0),2)","v":"Guide"},null,null,null,null,null,null,null,null,null,null,null,null,99,"Removed","Removed"]
[null,null,null,null,"UN","Unknown",null,"G-ALD2","Advanced lane direction [Message]","G",{"$f":"INDEX(sign_class[],MATCH(sign_type[[#This Row],[sign_class_code]],sign_class[sign_class_code],0),2)","v":"Guide"}]
[null,null,null,null,"WM","Warning Miscellaneous",null,"G-CDS1","Confirmation Destination","G",{"$f":"INDEX(sign_class[],MATCH(sign_type[[#This Row],[sign_class_code]],sign_class[sign_class_code],0),2)","v":"Guide"}]
[null,null,null,null,"WMW","Warning Motorway",null,"G-CD1","Confirmation Destination","G",{"$f":"INDEX(sign_class[],MATCH(sign_type[[#This Row],[sign_class_code]],sign_class[sign_class_code],0),2)","v":"Guide"}]
[null,null,null,null,"LR","Location Referencing (LRMS)",null,"G-IDS1","Intersection Direction","G",{"$f":"INDEX(sign_class[],MATCH(sign_type[[#This Row],[sign_class_code]],sign_class[sign_class_code],0),2)","v":"Guide"}]
[null,null,null,null,"TW","Temporary Warning",null,"G-ID1","Intersection Direction","G",{"$f":"INDEX(sign_class[],MATCH(sign_type[[#This Row],[sign_class_code]],sign_class[sign_class_code],0),2)","v":"Guide"}]
[null,null,null,null,null,null,null,"G-ID6","Intersection Direction - \"\"Fingerboard\"\" Street Name S","G",{"$f":"INDEX(sign_class[],MATCH(sign_type[[#This Row],[sign_class_code]],sign_class[sign_class_code],0),2)","v":"Guide"}]
[null,null,null,null,null,null,null,"G-ID5","Intersection Direction - \"\"T\"\"","G",{"$f":"INDEX(sign_class[],MATCH(sign_type[[#This Row],[sign_class_code]],sign_class[sign_class_code],0),2)","v":"Guide"}]
[null,null,null,null,null,null,null,"G-ID5A","Intersection Direction - \"\"T\"\" with Street name sign","G",{"$f":"INDEX(sign_class[],MATCH(sign_type[[#This Row],[sign_class_code]],sign_class[sign_class_code],0),2)","v":"Guide"}]
[null,null,null,null,null,null,null,"G-IDS5","Intersection Direction - \"T\"","G",{"$f":"INDEX(sign_class[],MATCH(sign_type[[#This Row],[sign_class_code]],sign_class[sign_class_code],0),2)","v":"Guide"}]
[null,null,null,null,null,null,null,"G-IDS5A","Intersection Direction - \"T\" with Street name sign","G",{"$f":"INDEX(sign_class[],MATCH(sign_type[[#This Row],[sign_class_code]],sign_class[sign_class_code],0),2)","v":"Guide"}]
[null,null,null,null,null,null,null,"G-ID2A","Intersection Direction  [Arrow] and St. name sign","G",{"$f":"INDEX(sign_class[],MATCH(sign_type[[#This Row],[sign_class_code]],sign_class[sign_class_code],0),2)","v":"Guide"}]
[null,null,null,null,null,null,null,"G-IDS3A","Intersection Direction - route marker with St.name sign","G",{"$f":"INDEX(sign_class[],MATCH(sign_type[[#This Row],[sign_class_code]],sign_class[sign_class_code],0),2)","v":"Guide"}]
[null,null,null,null,null,null,null,"G-ID3A","Intersection Direction - route marker with St.name sign","G",{"$f":"INDEX(sign_class[],MATCH(sign_type[[#This Row],[sign_class_code]],sign_class[sign_class_code],0),2)","v":"Guide"}]
[null,null,null,null,null,null,null,"G-IDSN","Intersection Direction - Street name sign","G",{"$f":"INDEX(sign_class[],MATCH(sign_type[[#This Row],[sign_class_code]],sign_class[sign_class_code],0),2)","v":"Guide"}]
[null,null,null,null,null,null,null,"G-IDS4","Intersection Direction - Urban","G",{"$f":"INDEX(sign_class[],MATCH(sign_type[[#This Row],[sign_class_code]],sign_class[sign_class_code],0),2)","v":"Guide"}]
[null,null,null,null,null,null,null,"G-ID4","Intersection Direction - Urban","G",{"$f":"INDEX(sign_class[],MATCH(sign_type[[#This Row],[sign_class_code]],sign_class[sign_class_code],0),2)","v":"Guide"}]
[null,null,null,null,null,null,null,"G-ID4A","Intersection Direction - Urban with street name sign","G",{"$f":"INDEX(sign_class[],MATCH(sign_type[[#This Row],[sign_class_code]],sign_class[sign_class_code],0),2)","v":"Guide"}]
[null,null,null,null,null,null,null,"G-IDS4A","Intersection Direction - Urban with Strret name sign","G",{"$f":"INDEX(sign_class[],MATCH(sign_type[[#This Row],[sign_class_code]],sign_class[sign_class_code],0),2)","v":"Guide"}]
[null,null,null,null,null,null,null,"G-IDS2","Intersection Direction - with arrow","G",{"$f":"INDEX(sign_class[],MATCH(sign_type[[#This Row],[sign_class_code]],sign_class[sign_class_code],0),2)","v":"Guide"}]
[null,null,null,null,null,null,null,"G-IDS2A","Intersection Direction - with arrow and St. name sign","G",{"$f":"INDEX(sign_class[],MATCH(sign_type[[#This Row],[sign_class_code]],sign_class[sign_class_code],0),2)","v":"Guide"}]
[null,null,null,null,null,null,null,"G-IDS3","Intersection Direction - with route marker","G",{"$f":"INDEX(sign_class[],MATCH(sign_type[[#This Row],[sign_class_code]],sign_class[sign_class_code],0),2)","v":"Guide"}]
[null,null,null,null,null,null,null,"G-ID3","Intersection Direction - with route marker","G",{"$f":"INDEX(sign_class[],MATCH(sign_type[[#This Row],[sign_class_code]],sign_class[sign_class_code],0),2)","v":"Guide"}]
[null,null,null,null,null,null,null,"G-ID2","Intersection Direction [Arrow]","G",{"$f":"INDEX(sign_class[],MATCH(sign_type[[#This Row],[sign_class_code]],sign_class[sign_class_code],0),2)","v":"Guide"}]
[null,null,null,null,null,null,null,"G-IDS1A","Intersection Direction sign with Street name sign","G",{"$f":"INDEX(sign_class[],MATCH(sign_type[[#This Row],[sign_class_code]],sign_class[sign_class_code],0),2)","v":"Guide"}]
[null,null,null,null,null,null,null,"G-ID1A","Intersection Direction sign with street name sign","G",{"$f":"INDEX(sign_class[],MATCH(sign_type[[#This Row],[sign_class_code]],sign_class[sign_class_code],0),2)","v":"Guide"}]
[null,null,null,null,null,null,null,"G-PNS1","Place Name","G",{"$f":"INDEX(sign_class[],MATCH(sign_type[[#This Row],[sign_class_code]],sign_class[sign_class_code],0),2)","v":"Guide"}]
[null,null,null,null,null,null,null,"G-PNSI","Place name","G",{"$f":"INDEX(sign_class[],MATCH(sign_type[[#This Row],[sign_class_code]],sign_class[sign_class_code],0),2)","v":"Guide"}]
[null,null,null,null,null,null,null,"G-PN1","Place Name","G",{"$f":"INDEX(sign_class[],MATCH(sign_type[[#This Row],[sign_class_code]],sign_class[sign_class_code],0),2)","v":"Guide"}]
[null,null,null,null,null,null,null,"G-RMS3","Route BEGINS","G",{"$f":"INDEX(sign_class[],MATCH(sign_type[[#This Row],[sign_class_code]],sign_class[sign_class_code],0),2)","v":"Guide"}]
[null,null,null,null,null,null,null,"G-RM3","Route BEGINS","G",{"$f":"INDEX(sign_class[],MATCH(sign_type[[#This Row],[sign_class_code]],sign_class[sign_class_code],0),2)","v":"Guide"}]
[null,null,null,null,null,null,null,"G-RMS4","Route ENDS","G",{"$f":"INDEX(sign_class[],MATCH(sign_type[[#This Row],[sign_class_code]],sign_class[sign_class_code],0),2)","v":"Guide"}]
[null,null,null,null,null,null,null,"G-RM4","Route ENDS","G",{"$f":"INDEX(sign_class[],MATCH(sign_type[[#This Row],[sign_class_code]],sign_class[sign_class_code],0),2)","v":"Guide"}]
[null,null,null,null,null,null,null,"G-RMS2","Route Marker - Double numeral","G",{"$f":"INDEX(sign_class[],MATCH(sign_type[[#This Row],[sign_class_code]],sign_class[sign_class_code],0),2)","v":"Guide"}]
[null,null,null,null,null,null,null,"G-RM2","Route Marker - Double numeral","G",{"$f":"INDEX(sign_class[],MATCH(sign_type[[#This Row],[sign_class_code]],sign_class[sign_class_code],0),2)","v":"Guide"}]
[null,null,null,null,null,null,null,"G-RMS1","Route Marker - Single numeral","G",{"$f":"INDEX(sign_class[],MATCH(sign_type[[#This Row],[sign_class_code]],sign_class[sign_class_code],0),2)","v":"Guide"}]
[null,null,null,null,null,null,null,"G-RM1","Route Marker - Single numeral","G",{"$f":"INDEX(sign_class[],MATCH(sign_type[[#This Row],[sign_class_code]],sign_class[sign_class_code],0),2)","v":"Guide"}]
[null,null,null,null,null,null,null,"G-SN1","Street Name Sign (white on blue)","G",{"$f":"INDEX(sign_class[],MATCH(sign_type[[#This Row],[sign_class_code]],sign_class[sign_class_code],0),2)","v":"Guide"}]
[null,null,null,null,null,null,null,"G-PN2","Threshold Sign - Place Name + Speed Limit","G",{"$f":"INDEX(sign_class[],MATCH(sign_type[[#This Row],[sign_class_code]],sign_class[sign_class_code],0),2)","v":"Guide"}]
[null,null,null,null,null,null,null,"H07","Bridge End Marker","H",{"$f":"INDEX(sign_class[],MATCH(sign_type[[#This Row],[sign_class_code]],sign_class[sign_class_code],0),2)","v":"Hazard Markings"}]
[null,null,null,null,null,null,null,"H01","Chevron Board","H",{"$f":"INDEX(sign_class[],MATCH(sign_type[[#This Row],[sign_class_code]],sign_class[sign_class_code],0),2)","v":"Hazard Markings"}]
[null,null,null,null,null,null,null,"H01-15","Chevron Board - Advisory speed 15km/h","H",{"$f":"INDEX(sign_class[],MATCH(sign_type[[#This Row],[sign_class_code]],sign_class[sign_class_code],0),2)","v":"Hazard Markings"}]
[null,null,null,null,null,null,null,"H01-25","Chevron Board - Advisory speed 25km/h","H",{"$f":"INDEX(sign_class[],MATCH(sign_type[[#This Row],[sign_class_code]],sign_class[sign_class_code],0),2)","v":"Hazard Markings"}]
[null,null,null,null,null,null,null,"H01-35","Chevron Board - Advisory speed 35km/h","H",{"$f":"INDEX(sign_class[],MATCH(sign_type[[#This Row],[sign_class_code]],sign_class[sign_class_code],0),2)","v":"Hazard Markings"}]
[null,null,null,null,null,null,null,"H01-45","Chevron Board - Advisory speed 45km/h","H",{"$f":"INDEX(sign_class[],MATCH(sign_type[[#This Row],[sign_class_code]],sign_class[sign_class_code],0),2)","v":"Hazard Markings"}]
[null,null,null,null,null,null,null,"H01-55","Chevron Board - Advisory speed 55km/h","H",{"$f":"INDEX(sign_class[],MATCH(sign_type[[#This Row],[sign_class_code]],sign_class[sign_class_code],0),2)","v":"Hazard Markings"}]
[null,null,null,null,null,null,null,"H01-65","Chevron Board - Advisory speed 65km/h","H",{"$f":"INDEX(sign_class[],MATCH(sign_type[[#This Row],[sign_class_code]],sign_class[sign_class_code],0),2)","v":"Hazard Markings"}]
[null,null,null,null,null,null,null,"H01-75","Chevron Board - Advisory speed 75km/h","H",{"$f":"INDEX(sign_class[],MATCH(sign_type[[#This Row],[sign_class_code]],sign_class[sign_class_code],0),2)","v":"Hazard Markings"}]
[null,null,null,null,null,null,null,"H01-85","Chevron Board - Advisory speed 85km/h","H",{"$f":"INDEX(sign_class[],MATCH(sign_type[[#This Row],[sign_class_code]],sign_class[sign_class_code],0),2)","v":"Hazard Markings"}]
[null,null,null,null,null,null,null,"H01-95","Chevron Board - Advisory speed 95km/h","H",{"$f":"INDEX(sign_class[],MATCH(sign_type[[#This Row],[sign_class_code]],sign_class[sign_class_code],0),2)","v":"Hazard Markings"}]
[null,null,null,null,null,null,null,"H01Y","Chevron Board (yellow reflectorised)","H",{"$f":"INDEX(sign_class[],MATCH(sign_type[[#This Row],[sign_class_code]],sign_class[sign_class_code],0),2)","v":"Hazard Markings"}]
[null,null,null,null,null,null,null,"H01Y-15","Chevron Board (yellow) - Advisory speed 15km/h","H",{"$f":"INDEX(sign_class[],MATCH(sign_type[[#This Row],[sign_class_code]],sign_class[sign_class_code],0),2)","v":"Hazard Markings"}]
[null,null,null,null,null,null,null,"H01Y-25","Chevron Board (yellow) - Advisory speed 25km/h","H",{"$f":"INDEX(sign_class[],MATCH(sign_type[[#This Row],[sign_class_code]],sign_class[sign_class_code],0),2)","v":"Hazard Markings"}]
[null,null,null,null,null,null,null,"H01Y-35","Chevron Board (yellow) - Advisory speed 35km/h","H",{"$f":"INDEX(sign_class[],MATCH(sign_type[[#This Row],[sign_class_code]],sign_class[sign_class_code],0),2)","v":"Hazard Markings"}]
[null,null,null,null,null,null,null,"H01Y-45","Chevron Board (yellow) - Advisory speed 45km/h","H",{"$f":"INDEX(sign_class[],MATCH(sign_type[[#This Row],[sign_class_code]],sign_class[sign_class_code],0),2)","v":"Hazard Markings"}]
[null,null,null,null,null,null,null,"H01Y-55","Chevron Board (yellow) - Advisory speed 55km/h","H",{"$f":"INDEX(sign_class[],MATCH(sign_type[[#This Row],[sign_class_code]],sign_class[sign_class_code],0),2)","v":"Hazard Markings"}]
[null,null,null,null,null,null,null,"H01Y-65","Chevron Board (yellow) - Advisory speed 65km/h","H",{"$f":"INDEX(sign_class[],MATCH(sign_type[[#This Row],[sign_class_code]],sign_class[sign_class_code],0),2)","v":"Hazard Markings"}]
[null,null,null,null,null,null,null,"H01Y-75","Chevron Board (yellow) - Advisory speed 75km/h","H",{"$f":"INDEX(sign_class[],MATCH(sign_type[[#This Row],[sign_class_code]],sign_class[sign_class_code],0),2)","v":"Hazard Markings"}]
[null,null,null,null,null,null,null,"H01Y-85","Chevron Board (yellow) - Advisory speed 85km/h","H",{"$f":"INDEX(sign_class[],MATCH(sign_type[[#This Row],[sign_class_code]],sign_class[sign_class_code],0),2)","v":"Hazard Markings"}]
[null,null,null,null,null,null,null,"H01Y-95","Chevron Board (yellow) - Advisory speed 95km/h","H",{"$f":"INDEX(sign_class[],MATCH(sign_type[[#This Row],[sign_class_code]],sign_class[sign_class_code],0),2)","v":"Hazard Markings"}]
[null,null,null,null,null,null,null,"H08","Crash Cushion Hazard Marker","H",{"$f":"INDEX(sign_class[],MATCH(sign_type[[#This Row],[sign_class_code]],sign_class[sign_class_code],0),2)","v":"Hazard Markings"}]
[null,null,null,null,null,null,null,"H05","Hazard Marker","H",{"$f":"INDEX(sign_class[],MATCH(sign_type[[#This Row],[sign_class_code]],sign_class[sign_class_code],0),2)","v":"Hazard Markings"}]
[null,null,null,null,null,null,null,"H04","Single Chevron","H",{"$f":"INDEX(sign_class[],MATCH(sign_type[[#This Row],[sign_class_code]],sign_class[sign_class_code],0),2)","v":"Hazard Markings"}]
[null,null,null,null,null,null,null,"I64","_________ FALLS","I",{"$f":"INDEX(sign_class[],MATCH(sign_type[[#This Row],[sign_class_code]],sign_class[sign_class_code],0),2)","v":"Information signs"}]
[null,null,null,null,null,null,null,"O-I64","_________ FALLS","I",{"$f":"INDEX(sign_class[],MATCH(sign_type[[#This Row],[sign_class_code]],sign_class[sign_class_code],0),2)","v":"Information signs"}]
[null,null,null,null,null,null,null,"I46","_________ LOOKOUT","I",{"$f":"INDEX(sign_class[],MATCH(sign_type[[#This Row],[sign_class_code]],sign_class[sign_class_code],0),2)","v":"Information signs"}]
[null,null,null,null,null,null,null,"O-I46","_________ LOOKOUT","I",{"$f":"INDEX(sign_class[],MATCH(sign_type[[#This Row],[sign_class_code]],sign_class[sign_class_code],0),2)","v":"Information signs"}]
[null,null,null,null,null,null,null,"I45","_________ LOOKOUT 400m","I",{"$f":"INDEX(sign_class[],MATCH(sign_type[[#This Row],[sign_class_code]],sign_class[sign_class_code],0),2)","v":"Information signs"}]
[null,null,null,null,null,null,null,"O-I45","_________ LOOKOUT 400m","I",{"$f":"INDEX(sign_class[],MATCH(sign_type[[#This Row],[sign_class_code]],sign_class[sign_class_code],0),2)","v":"Information signs"}]
[null,null,null,null,null,null,null,"I65","_________ RAPIDS","I",{"$f":"INDEX(sign_class[],MATCH(sign_type[[#This Row],[sign_class_code]],sign_class[sign_class_code],0),2)","v":"Information signs"}]
[null,null,null,null,null,null,null,"O-I65","_________ RAPIDS","I",{"$f":"INDEX(sign_class[],MATCH(sign_type[[#This Row],[sign_class_code]],sign_class[sign_class_code],0),2)","v":"Information signs"}]
[null,null,null,null,null,null,null,"I62","_________ SUMMIT \"__\"m","I",{"$f":"INDEX(sign_class[],MATCH(sign_type[[#This Row],[sign_class_code]],sign_class[sign_class_code],0),2)","v":"Information signs"}]
[null,null,null,null,null,null,null,"O-I26","ADVANCE DIRECTION (Cross Roads)","I",{"$f":"INDEX(sign_class[],MATCH(sign_type[[#This Row],[sign_class_code]],sign_class[sign_class_code],0),2)","v":"Information signs"}]
[null,null,null,null,null,null,null,"O-I22","Advance Direction (Cross Roads)","I",{"$f":"INDEX(sign_class[],MATCH(sign_type[[#This Row],[sign_class_code]],sign_class[sign_class_code],0),2)","v":"Information signs"}]
[null,null,null,null,null,null,null,"I26","ADVANCE DIRECTION (Cross Roads)","I",{"$f":"INDEX(sign_class[],MATCH(sign_type[[#This Row],[sign_class_code]],sign_class[sign_class_code],0),2)","v":"Information signs"}]
[null,null,null,null,null,null,null,"I22","Advance Direction (Cross Roads)","I",{"$f":"INDEX(sign_class[],MATCH(sign_type[[#This Row],[sign_class_code]],sign_class[sign_class_code],0),2)","v":"Information signs"}]
[null,null,null,null,null,null,null,"O-I25","ADVANCE DIRECTION (Skew Intersection)","I",{"$f":"INDEX(sign_class[],MATCH(sign_type[[#This Row],[sign_class_code]],sign_class[sign_class_code],0),2)","v":"Information signs"}]
[null,null,null,null,null,null,null,"I25","ADVANCE DIRECTION (Skew Intersection)","I",{"$f":"INDEX(sign_class[],MATCH(sign_type[[#This Row],[sign_class_code]],sign_class[sign_class_code],0),2)","v":"Information signs"}]
[null,null,null,null,null,null,null,"O-I24","Advance Direction (T Intersect head of T ahead)","I",{"$f":"INDEX(sign_class[],MATCH(sign_type[[#This Row],[sign_class_code]],sign_class[sign_class_code],0),2)","v":"Information signs"}]
[null,null,null,null,null,null,null,"I24","Advance Direction (T Intersect head of T ahead)","I",{"$f":"INDEX(sign_class[],MATCH(sign_type[[#This Row],[sign_class_code]],sign_class[sign_class_code],0),2)","v":"Information signs"}]
[null,null,null,null,null,null,null,"O-I23","Advance Direction (T Intersect tail on side)","I",{"$f":"INDEX(sign_class[],MATCH(sign_type[[#This Row],[sign_class_code]],sign_class[sign_class_code],0),2)","v":"Information signs"}]
[null,null,null,null,null,null,null,"I23","Advance Direction (T Intersect tail on side)","I",{"$f":"INDEX(sign_class[],MATCH(sign_type[[#This Row],[sign_class_code]],sign_class[sign_class_code],0),2)","v":"Information signs"}]
[null,null,null,null,null,null,null,"I12","BELLS OFF (Railway level crossing)","I",{"$f":"INDEX(sign_class[],MATCH(sign_type[[#This Row],[sign_class_code]],sign_class[sign_class_code],0),2)","v":"Information signs"}]
[null,null,null,null,null,null,null,"O-I51","CAR PARK","I",{"$f":"INDEX(sign_class[],MATCH(sign_type[[#This Row],[sign_class_code]],sign_class[sign_class_code],0),2)","v":"Information signs"}]
[null,null,null,null,null,null,null,"I51","CAR PARK","I",{"$f":"INDEX(sign_class[],MATCH(sign_type[[#This Row],[sign_class_code]],sign_class[sign_class_code],0),2)","v":"Information signs"}]
[null,null,null,null,null,null,null,"O-I28","CONFIRMATORY DESTINATION","I",{"$f":"INDEX(sign_class[],MATCH(sign_type[[#This Row],[sign_class_code]],sign_class[sign_class_code],0),2)","v":"Information signs"}]
[null,null,null,null,null,null,null,"I28","CONFIRMATORY DESTINATION","I",{"$f":"INDEX(sign_class[],MATCH(sign_type[[#This Row],[sign_class_code]],sign_class[sign_class_code],0),2)","v":"Information signs"}]
[null,null,null,null,null,null,null,"I08","CONSTRUCTION ZONE","I",{"$f":"INDEX(sign_class[],MATCH(sign_type[[#This Row],[sign_class_code]],sign_class[sign_class_code],0),2)","v":"Information signs"}]
[null,null,null,null,null,null,null,"I60","COUNTY/DISTRICT BOUNDARY","I",{"$f":"INDEX(sign_class[],MATCH(sign_type[[#This Row],[sign_class_code]],sign_class[sign_class_code],0),2)","v":"Information signs"}]
[null,null,null,null,null,null,null,"O-I27","DESTINATION (Stack)","I",{"$f":"INDEX(sign_class[],MATCH(sign_type[[#This Row],[sign_class_code]],sign_class[sign_class_code],0),2)","v":"Information signs"}]
[null,null,null,null,null,null,null,"I27","DESTINATION (Stack)","I",{"$f":"INDEX(sign_class[],MATCH(sign_type[[#This Row],[sign_class_code]],sign_class[sign_class_code],0),2)","v":"Information signs"}]
[null,null,null,null,null,null,null,"O-I33","DESTINATIONS (Flag)","I",{"$f":"INDEX(sign_class[],MATCH(sign_type[[#This Row],[sign_class_code]],sign_class[sign_class_code],0),2)","v":"Information signs"}]
[null,null,null,null,null,null,null,"I33","DESTINATIONS (Flag)","I",{"$f":"INDEX(sign_class[],MATCH(sign_type[[#This Row],[sign_class_code]],sign_class[sign_class_code],0),2)","v":"Information signs"}]
[null,null,null,null,null,null,null,"I63","ELEVATION \"__\"m","I",{"$f":"INDEX(sign_class[],MATCH(sign_type[[#This Row],[sign_class_code]],sign_class[sign_class_code],0),2)","v":"Information signs"}]
[null,null,null,null,null,null,null,"O-I31","END OF STATE HIGHWAY","I",{"$f":"INDEX(sign_class[],MATCH(sign_type[[#This Row],[sign_class_code]],sign_class[sign_class_code],0),2)","v":"Information signs"}]
[null,null,null,null,null,null,null,"I31","END OF STATE HIGHWAY","I",{"$f":"INDEX(sign_class[],MATCH(sign_type[[#This Row],[sign_class_code]],sign_class[sign_class_code],0),2)","v":"Information signs"}]
[null,null,null,null,null,null,null,"I30","FINGER BOARD","I",{"$f":"INDEX(sign_class[],MATCH(sign_type[[#This Row],[sign_class_code]],sign_class[sign_class_code],0),2)","v":"Information signs"}]
[null,null,null,null,null,null,null,"O-I09","FREE TURN","I",{"$f":"INDEX(sign_class[],MATCH(sign_type[[#This Row],[sign_class_code]],sign_class[sign_class_code],0),2)","v":"Information signs"}]
[null,null,null,null,null,null,null,"I09","FREE TURN","I",{"$f":"INDEX(sign_class[],MATCH(sign_type[[#This Row],[sign_class_code]],sign_class[sign_class_code],0),2)","v":"Information signs"}]
[null,null,null,null,null,null,null,"I14","HEAVY TRAFFIC BY PASS","I",{"$f":"INDEX(sign_class[],MATCH(sign_type[[#This Row],[sign_class_code]],sign_class[sign_class_code],0),2)","v":"Information signs"}]
[null,null,null,null,null,null,null,"I13","HEAVY TRAFFIC BY PASS \"__\"m","I",{"$f":"INDEX(sign_class[],MATCH(sign_type[[#This Row],[sign_class_code]],sign_class[sign_class_code],0),2)","v":"Information signs"}]
[null,null,null,null,null,null,null,"O-I48","HISTORIC PLACE","I",{"$f":"INDEX(sign_class[],MATCH(sign_type[[#This Row],[sign_class_code]],sign_class[sign_class_code],0),2)","v":"Information signs"}]
[null,null,null,null,null,null,null,"I48","HISTORIC PLACE","I",{"$f":"INDEX(sign_class[],MATCH(sign_type[[#This Row],[sign_class_code]],sign_class[sign_class_code],0),2)","v":"Information signs"}]
[null,null,null,null,null,null,null,"O-I47","HISTORIC PLACE 400m","I",{"$f":"INDEX(sign_class[],MATCH(sign_type[[#This Row],[sign_class_code]],sign_class[sign_class_code],0),2)","v":"Information signs"}]
[null,null,null,null,null,null,null,"I47","HISTORIC PLACE 400m","I",{"$f":"INDEX(sign_class[],MATCH(sign_type[[#This Row],[sign_class_code]],sign_class[sign_class_code],0),2)","v":"Information signs"}]
[null,null,null,null,null,null,null,"O-I66","HOT SPRINGS","I",{"$f":"INDEX(sign_class[],MATCH(sign_type[[#This Row],[sign_class_code]],sign_class[sign_class_code],0),2)","v":"Information signs"}]
[null,null,null,null,null,null,null,"I66","HOT SPRINGS","I",{"$f":"INDEX(sign_class[],MATCH(sign_type[[#This Row],[sign_class_code]],sign_class[sign_class_code],0),2)","v":"Information signs"}]
[null,null,null,null,null,null,null,"O-I40","HOTEL(S)","I",{"$f":"INDEX(sign_class[],MATCH(sign_type[[#This Row],[sign_class_code]],sign_class[sign_class_code],0),2)","v":"Information signs"}]
[null,null,null,null,null,null,null,"I40","HOTEL(S)","I",{"$f":"INDEX(sign_class[],MATCH(sign_type[[#This Row],[sign_class_code]],sign_class[sign_class_code],0),2)","v":"Information signs"}]
[null,null,null,null,null,null,null,"O-I32B","INFORMATION CENTRE","I",{"$f":"INDEX(sign_class[],MATCH(sign_type[[#This Row],[sign_class_code]],sign_class[sign_class_code],0),2)","v":"Information signs"}]
[null,null,null,null,null,null,null,"I32B","INFORMATION CENTRE","I",{"$f":"INDEX(sign_class[],MATCH(sign_type[[#This Row],[sign_class_code]],sign_class[sign_class_code],0),2)","v":"Information signs"}]
[null,null,null,null,null,null,null,"O-I32A","INFORMATION CENTRE \"\"________________\"\"m (km)","I",{"$f":"INDEX(sign_class[],MATCH(sign_type[[#This Row],[sign_class_code]],sign_class[sign_class_code],0),2)","v":"Information signs"}]
[null,null,null,null,null,null,null,"I32A","INFORMATION CENTRE \"__\"m (km)","I",{"$f":"INDEX(sign_class[],MATCH(sign_type[[#This Row],[sign_class_code]],sign_class[sign_class_code],0),2)","v":"Information signs"}]
[null,null,null,null,null,null,null,"O-I34","INTERSECTION ADVANCE WARNING","I",{"$f":"INDEX(sign_class[],MATCH(sign_type[[#This Row],[sign_class_code]],sign_class[sign_class_code],0),2)","v":"Information signs"}]
[null,null,null,null,null,null,null,"I34","INTERSECTION ADVANCE WARNING","I",{"$f":"INDEX(sign_class[],MATCH(sign_type[[#This Row],[sign_class_code]],sign_class[sign_class_code],0),2)","v":"Information signs"}]
[null,null,null,null,null,null,null,"O-I41","MOTEL(S)","I",{"$f":"INDEX(sign_class[],MATCH(sign_type[[#This Row],[sign_class_code]],sign_class[sign_class_code],0),2)","v":"Information signs"}]
[null,null,null,null,null,null,null,"I41","MOTEL(S)","I",{"$f":"INDEX(sign_class[],MATCH(sign_type[[#This Row],[sign_class_code]],sign_class[sign_class_code],0),2)","v":"Information signs"}]
[null,null,null,null,null,null,null,"O-I42","MOTOR CAMP(S)","I",{"$f":"INDEX(sign_class[],MATCH(sign_type[[#This Row],[sign_class_code]],sign_class[sign_class_code],0),2)","v":"Information signs"}]
[null,null,null,null,null,null,null,"I42","MOTOR CAMP(S)","I",{"$f":"INDEX(sign_class[],MATCH(sign_type[[#This Row],[sign_class_code]],sign_class[sign_class_code],0),2)","v":"Information signs"}]
[null,null,null,null,null,null,null,"O-I20","National State Highway route marker","I",{"$f":"INDEX(sign_class[],MATCH(sign_type[[#This Row],[sign_class_code]],sign_class[sign_class_code],0),2)","v":"Information signs"}]
[null,null,null,null,null,null,null,"I20","National State Highway route marker","I",{"$f":"INDEX(sign_class[],MATCH(sign_type[[#This Row],[sign_class_code]],sign_class[sign_class_code],0),2)","v":"Information signs"}]
[null,null,null,null,null,null,null,"I06","NO EXIT","I",{"$f":"INDEX(sign_class[],MATCH(sign_type[[#This Row],[sign_class_code]],sign_class[sign_class_code],0),2)","v":"Information signs"}]
[null,null,null,null,null,null,null,"O-I49A","ON LEFT","I",{"$f":"INDEX(sign_class[],MATCH(sign_type[[#This Row],[sign_class_code]],sign_class[sign_class_code],0),2)","v":"Information signs"}]
[null,null,null,null,null,null,null,"I49A","ON LEFT","I",{"$f":"INDEX(sign_class[],MATCH(sign_type[[#This Row],[sign_class_code]],sign_class[sign_class_code],0),2)","v":"Information signs"}]
[null,null,null,null,null,null,null,"O-I49B","ON RIGHT","I",{"$f":"INDEX(sign_class[],MATCH(sign_type[[#This Row],[sign_class_code]],sign_class[sign_class_code],0),2)","v":"Information signs"}]
[null,null,null,null,null,null,null,"I49B","ON RIGHT","I",{"$f":"INDEX(sign_class[],MATCH(sign_type[[#This Row],[sign_class_code]],sign_class[sign_class_code],0),2)","v":"Information signs"}]
[null,null,null,null,null,null,null,"O-I50","PARKING BUILDING","I",{"$f":"INDEX(sign_class[],MATCH(sign_type[[#This Row],[sign_class_code]],sign_class[sign_class_code],0),2)","v":"Information signs"}]
[null,null,null,null,null,null,null,"I50","PARKING BUILDING","I",{"$f":"INDEX(sign_class[],MATCH(sign_type[[#This Row],[sign_class_code]],sign_class[sign_class_code],0),2)","v":"Information signs"}]
[null,null,null,null,null,null,null,"I05","PASSING BAY \"___\"m","I",{"$f":"INDEX(sign_class[],MATCH(sign_type[[#This Row],[sign_class_code]],sign_class[sign_class_code],0),2)","v":"Information signs"}]
[null,null,null,null,null,null,null,"I04-1","PASSING LANE 1km","I",{"$f":"INDEX(sign_class[],MATCH(sign_type[[#This Row],[sign_class_code]],sign_class[sign_class_code],0),2)","v":"Information signs"}]
[null,null,null,null,null,null,null,"I04-2","PASSING LANE 2km","I",{"$f":"INDEX(sign_class[],MATCH(sign_type[[#This Row],[sign_class_code]],sign_class[sign_class_code],0),2)","v":"Information signs"}]
[null,null,null,null,null,null,null,"I04","PASSING LANE 400m","I",{"$f":"INDEX(sign_class[],MATCH(sign_type[[#This Row],[sign_class_code]],sign_class[sign_class_code],0),2)","v":"Information signs"}]
[null,null,null,null,null,null,null,"I04-5","PASSING LANE 5km","I",{"$f":"INDEX(sign_class[],MATCH(sign_type[[#This Row],[sign_class_code]],sign_class[sign_class_code],0),2)","v":"Information signs"}]
[null,null,null,null,null,null,null,"O-I29","PLACE NAME","I",{"$f":"INDEX(sign_class[],MATCH(sign_type[[#This Row],[sign_class_code]],sign_class[sign_class_code],0),2)","v":"Information signs"}]
[null,null,null,null,null,null,null,"I29","PLACE NAME","I",{"$f":"INDEX(sign_class[],MATCH(sign_type[[#This Row],[sign_class_code]],sign_class[sign_class_code],0),2)","v":"Information signs"}]
[null,null,null,null,null,null,null,"O-I21","Provincial State Highway route marker","I",{"$f":"INDEX(sign_class[],MATCH(sign_type[[#This Row],[sign_class_code]],sign_class[sign_class_code],0),2)","v":"Information signs"}]
[null,null,null,null,null,null,null,"I21","Provincial State Highway route marker","I",{"$f":"INDEX(sign_class[],MATCH(sign_type[[#This Row],[sign_class_code]],sign_class[sign_class_code],0),2)","v":"Information signs"}]
[null,null,null,null,null,null,null,"O-I44","REST AREA","I",{"$f":"INDEX(sign_class[],MATCH(sign_type[[#This Row],[sign_class_code]],sign_class[sign_class_code],0),2)","v":"Information signs"}]
[null,null,null,null,null,null,null,"I44","REST AREA","I",{"$f":"INDEX(sign_class[],MATCH(sign_type[[#This Row],[sign_class_code]],sign_class[sign_class_code],0),2)","v":"Information signs"}]
[null,null,null,null,null,null,null,"O-I43","REST AREA 400m","I",{"$f":"INDEX(sign_class[],MATCH(sign_type[[#This Row],[sign_class_code]],sign_class[sign_class_code],0),2)","v":"Information signs"}]
[null,null,null,null,null,null,null,"I43","REST AREA 400m","I",{"$f":"INDEX(sign_class[],MATCH(sign_type[[#This Row],[sign_class_code]],sign_class[sign_class_code],0),2)","v":"Information signs"}]
[null,null,null,null,null,null,null,"I61","RIVER/STREAM","I",{"$f":"INDEX(sign_class[],MATCH(sign_type[[#This Row],[sign_class_code]],sign_class[sign_class_code],0),2)","v":"Information signs"}]
[null,null,null,null,null,null,null,"O-I02","STOPPING RESTRICTION ENDS","I",{"$f":"INDEX(sign_class[],MATCH(sign_type[[#This Row],[sign_class_code]],sign_class[sign_class_code],0),2)","v":"Information signs"}]
[null,null,null,null,null,null,null,"I02","STOPPING RESTRICTION ENDS","I",{"$f":"INDEX(sign_class[],MATCH(sign_type[[#This Row],[sign_class_code]],sign_class[sign_class_code],0),2)","v":"Information signs"}]
[null,null,null,null,null,null,null,"O-I10","THANK YOU","I",{"$f":"INDEX(sign_class[],MATCH(sign_type[[#This Row],[sign_class_code]],sign_class[sign_class_code],0),2)","v":"Information signs"}]
[null,null,null,null,null,null,null,"I10","THANK YOU","I",{"$f":"INDEX(sign_class[],MATCH(sign_type[[#This Row],[sign_class_code]],sign_class[sign_class_code],0),2)","v":"Information signs"}]
[null,null,null,null,null,null,null,"O-I67","THERMAL AREA","I",{"$f":"INDEX(sign_class[],MATCH(sign_type[[#This Row],[sign_class_code]],sign_class[sign_class_code],0),2)","v":"Information signs"}]
[null,null,null,null,null,null,null,"I67","THERMAL AREA","I",{"$f":"INDEX(sign_class[],MATCH(sign_type[[#This Row],[sign_class_code]],sign_class[sign_class_code],0),2)","v":"Information signs"}]
[null,null,null,null,null,null,null,"O-I52","TOILET","I",{"$f":"INDEX(sign_class[],MATCH(sign_type[[#This Row],[sign_class_code]],sign_class[sign_class_code],0),2)","v":"Information signs"}]
[null,null,null,null,null,null,null,"I52","TOILET","I",{"$f":"INDEX(sign_class[],MATCH(sign_type[[#This Row],[sign_class_code]],sign_class[sign_class_code],0),2)","v":"Information signs"}]
[null,null,null,null,null,null,null,"O-I11","WORKS END","I",{"$f":"INDEX(sign_class[],MATCH(sign_type[[#This Row],[sign_class_code]],sign_class[sign_class_code],0),2)","v":"Information signs"}]
[null,null,null,null,null,null,null,"I11","WORKS END","I",{"$f":"INDEX(sign_class[],MATCH(sign_type[[#This Row],[sign_class_code]],sign_class[sign_class_code],0),2)","v":"Information signs"}]
[null,null,null,null,null,null,null,"IG16","__ SUMMIT \"\"__\"\"m","IG",{"$f":"INDEX(sign_class[],MATCH(sign_type[[#This Row],[sign_class_code]],sign_class[sign_class_code],0),2)","v":"Information General"}]
[null,null,null,null,null,null,null,"IG03","BELLS OFF (Railway level crossing)","IG",{"$f":"INDEX(sign_class[],MATCH(sign_type[[#This Row],[sign_class_code]],sign_class[sign_class_code],0),2)","v":"Information General"}]
[null,null,null,null,null,null,null,"IG11","CONSTRUCTION ZONE","IG",{"$f":"INDEX(sign_class[],MATCH(sign_type[[#This Row],[sign_class_code]],sign_class[sign_class_code],0),2)","v":"Information General"}]
[null,null,null,null,null,null,null,"IG22","Cyclists - CROSS HERE WITH CARE [Arrow]","IG",{"$f":"INDEX(sign_class[],MATCH(sign_type[[#This Row],[sign_class_code]],sign_class[sign_class_code],0),2)","v":"Information General"}]
[null,null,null,null,null,null,null,"IG20","Cyclists - USE LEFT SHOULDER","IG",{"$f":"INDEX(sign_class[],MATCH(sign_type[[#This Row],[sign_class_code]],sign_class[sign_class_code],0),2)","v":"Information General"}]
[null,null,null,null,null,null,null,"IG21","Cyclists - USE RAMP [Arrow]","IG",{"$f":"INDEX(sign_class[],MATCH(sign_type[[#This Row],[sign_class_code]],sign_class[sign_class_code],0),2)","v":"Information General"}]
[null,null,null,null,null,null,null,"IG13","DISTRICT BOUNDARY","IG",{"$f":"INDEX(sign_class[],MATCH(sign_type[[#This Row],[sign_class_code]],sign_class[sign_class_code],0),2)","v":"Information General"}]
[null,null,null,null,null,null,null,"IG15","ELEVATION \"\"__\"\" m","IG",{"$f":"INDEX(sign_class[],MATCH(sign_type[[#This Row],[sign_class_code]],sign_class[sign_class_code],0),2)","v":"Information General"}]
[null,null,null,null,null,null,null,"IG12","FINGER BOARD (public amenities)","IG",{"$f":"INDEX(sign_class[],MATCH(sign_type[[#This Row],[sign_class_code]],sign_class[sign_class_code],0),2)","v":"Information General"}]
[null,null,null,null,null,null,null,"IG04","HEAVY TRAFFIC BY PASS \"\"__\"\" m","IG",{"$f":"INDEX(sign_class[],MATCH(sign_type[[#This Row],[sign_class_code]],sign_class[sign_class_code],0),2)","v":"Information General"}]
[null,null,null,null,null,null,null,"IG05","HEAVY TRAFFIC BY PASS [Arrow]","IG",{"$f":"INDEX(sign_class[],MATCH(sign_type[[#This Row],[sign_class_code]],sign_class[sign_class_code],0),2)","v":"Information General"}]
[null,null,null,null,null,null,null,"IG17","HEAVY VEHICLES PLEASE NO ENGINE BRAKES NEXT \"\"__\"\"KM","IG",{"$f":"INDEX(sign_class[],MATCH(sign_type[[#This Row],[sign_class_code]],sign_class[sign_class_code],0),2)","v":"Information General"}]
[null,null,null,null,null,null,null,"IG01","NO EXIT","IG",{"$f":"INDEX(sign_class[],MATCH(sign_type[[#This Row],[sign_class_code]],sign_class[sign_class_code],0),2)","v":"Information General"}]
[null,null,null,null,null,null,null,"SPE","Non-Standard Information Sign","IG",{"$f":"INDEX(sign_class[],MATCH(sign_type[[#This Row],[sign_class_code]],sign_class[sign_class_code],0),2)","v":"Information General"}]
[null,null,null,null,null,null,null,"IG07","PASSING BAY \"\"__\"\" m","IG",{"$f":"INDEX(sign_class[],MATCH(sign_type[[#This Row],[sign_class_code]],sign_class[sign_class_code],0),2)","v":"Information General"}]
[null,null,null,null,null,null,null,"IG06A","PASSING LANE \"\"_\"\" km AHEAD","IG",{"$f":"INDEX(sign_class[],MATCH(sign_type[[#This Row],[sign_class_code]],sign_class[sign_class_code],0),2)","v":"Information General"}]
[null,null,null,null,null,null,null,"IG06","PASSING LANE 400m","IG",{"$f":"INDEX(sign_class[],MATCH(sign_type[[#This Row],[sign_class_code]],sign_class[sign_class_code],0),2)","v":"Information General"}]
[null,null,null,null,null,null,null,"IG14","RIVER / STREAM","IG",{"$f":"INDEX(sign_class[],MATCH(sign_type[[#This Row],[sign_class_code]],sign_class[sign_class_code],0),2)","v":"Information General"}]
[null,null,null,null,null,null,null,"IG09","SLOW VEHICLE BAY \"__\"m","IG",{"$f":"INDEX(sign_class[],MATCH(sign_type[[#This Row],[sign_class_code]],sign_class[sign_class_code],0),2)","v":"Information General"}]
[null,null,null,null,null,null,null,"IG10","SLOW VEHICLE BAY with arrow","IG",{"$f":"INDEX(sign_class[],MATCH(sign_type[[#This Row],[sign_class_code]],sign_class[sign_class_code],0),2)","v":"Information General"}]
[null,null,null,null,null,null,null,"IG08","SLOW VEHICLE BAYS NEXT \"__\" km","IG",{"$f":"INDEX(sign_class[],MATCH(sign_type[[#This Row],[sign_class_code]],sign_class[sign_class_code],0),2)","v":"Information General"}]
[null,null,null,null,null,null,null,"IG18","STOCK EFFLUENT DISPOSAL \"____\"m ON RIGHT","IG",{"$f":"INDEX(sign_class[],MATCH(sign_type[[#This Row],[sign_class_code]],sign_class[sign_class_code],0),2)","v":"Information General"}]
[null,null,null,null,null,null,null,"IG19","STOCK EFFLUENT DISPOSAL [Arrow]","IG",{"$f":"INDEX(sign_class[],MATCH(sign_type[[#This Row],[sign_class_code]],sign_class[sign_class_code],0),2)","v":"Information General"}]
[null,null,null,null,null,null,null,"IG24","STOPPING BAY \"__\" m","IG",{"$f":"INDEX(sign_class[],MATCH(sign_type[[#This Row],[sign_class_code]],sign_class[sign_class_code],0),2)","v":"Information General"}]
[null,null,null,null,null,null,null,"IG25","STOPPING BAY [Arrow]","IG",{"$f":"INDEX(sign_class[],MATCH(sign_type[[#This Row],[sign_class_code]],sign_class[sign_class_code],0),2)","v":"Information General"}]
[null,null,null,null,null,null,null,"IG02","TURN LEFT AT ANY TIME WITH CARE","IG",{"$f":"INDEX(sign_class[],MATCH(sign_type[[#This Row],[sign_class_code]],sign_class[sign_class_code],0),2)","v":"Information General"}]
[null,null,null,null,null,null,null,"IG23","USE HEADLAMPS IN TUNNEL","IG",{"$f":"INDEX(sign_class[],MATCH(sign_type[[#This Row],[sign_class_code]],sign_class[sign_class_code],0),2)","v":"Information General"}]
[null,null,null,null,null,null,null,"IM07","*555 Traffic Patrol","IM",{"$f":"INDEX(sign_class[],MATCH(sign_type[[#This Row],[sign_class_code]],sign_class[sign_class_code],0),2)","v":"Information Miscellaneous"}]
[null,null,null,null,null,null,null,"IM21","Airport Direction (pictorial)","IM",{"$f":"INDEX(sign_class[],MATCH(sign_type[[#This Row],[sign_class_code]],sign_class[sign_class_code],0),2)","v":"Information Miscellaneous"}]
[null,null,null,null,null,null,null,"IM14","Camping Area","IM",{"$f":"INDEX(sign_class[],MATCH(sign_type[[#This Row],[sign_class_code]],sign_class[sign_class_code],0),2)","v":"Information Miscellaneous"}]
[null,null,null,null,null,null,null,"IM12","Caravan Park","IM",{"$f":"INDEX(sign_class[],MATCH(sign_type[[#This Row],[sign_class_code]],sign_class[sign_class_code],0),2)","v":"Information Miscellaneous"}]
[null,null,null,null,null,null,null,"IM13","Caravan Waste Disposal","IM",{"$f":"INDEX(sign_class[],MATCH(sign_type[[#This Row],[sign_class_code]],sign_class[sign_class_code],0),2)","v":"Information Miscellaneous"}]
[null,null,null,null,null,null,null,"IM05","CHECK YOUR LIGHTS","IM",{"$f":"INDEX(sign_class[],MATCH(sign_type[[#This Row],[sign_class_code]],sign_class[sign_class_code],0),2)","v":"Information Miscellaneous"}]
[null,null,null,null,null,null,null,"IM15","Emergency Telephone","IM",{"$f":"INDEX(sign_class[],MATCH(sign_type[[#This Row],[sign_class_code]],sign_class[sign_class_code],0),2)","v":"Information Miscellaneous"}]
[null,null,null,null,null,null,null,"IM22","Flucal CHILDREN CROSSING","IM",{"$f":"INDEX(sign_class[],MATCH(sign_type[[#This Row],[sign_class_code]],sign_class[sign_class_code],0),2)","v":"Information Miscellaneous"}]
[null,null,null,null,null,null,null,"IM24","FUNERAL","IM",{"$f":"INDEX(sign_class[],MATCH(sign_type[[#This Row],[sign_class_code]],sign_class[sign_class_code],0),2)","v":"Information Miscellaneous"}]
[null,null,null,null,null,null,null,"IM10","HOSPITAL","IM",{"$f":"INDEX(sign_class[],MATCH(sign_type[[#This Row],[sign_class_code]],sign_class[sign_class_code],0),2)","v":"Information Miscellaneous"}]
[null,null,null,null,null,null,null,"IM06","Information (Miscellaneous Sign) - User Defined","IM",{"$f":"INDEX(sign_class[],MATCH(sign_type[[#This Row],[sign_class_code]],sign_class[sign_class_code],0),2)","v":"Information Miscellaneous"}]
[null,null,null,null,null,null,null,"IM11","Motorist Amentities","IM",{"$f":"INDEX(sign_class[],MATCH(sign_type[[#This Row],[sign_class_code]],sign_class[sign_class_code],0),2)","v":"Information Miscellaneous"}]
[null,null,null,null,null,null,null,"IM23","NO HORSES","IM",{"$f":"INDEX(sign_class[],MATCH(sign_type[[#This Row],[sign_class_code]],sign_class[sign_class_code],0),2)","v":"Information Miscellaneous"}]
[null,null,null,null,null,null,null,"IM04","ROAD INFORMATION","IM",{"$f":"INDEX(sign_class[],MATCH(sign_type[[#This Row],[sign_class_code]],sign_class[sign_class_code],0),2)","v":"Information Miscellaneous"}]
[null,null,null,null,null,null,null,"IM03","Speedo Test End","IM",{"$f":"INDEX(sign_class[],MATCH(sign_type[[#This Row],[sign_class_code]],sign_class[sign_class_code],0),2)","v":"Information Miscellaneous"}]
[null,null,null,null,null,null,null,"IM02","Speedo Test Start","IM",{"$f":"INDEX(sign_class[],MATCH(sign_type[[#This Row],[sign_class_code]],sign_class[sign_class_code],0),2)","v":"Information Miscellaneous"}]
[null,null,null,null,null,null,null,"IM01","Speedo Test Warning","IM",{"$f":"INDEX(sign_class[],MATCH(sign_type[[#This Row],[sign_class_code]],sign_class[sign_class_code],0),2)","v":"Information Miscellaneous"}]
[null,null,null,null,null,null,null,"IMW01","Advance Exit","IMW",{"$f":"INDEX(sign_class[],MATCH(sign_type[[#This Row],[sign_class_code]],sign_class[sign_class_code],0),2)","v":"Information Motorway"}]
[null,null,null,null,null,null,null,"IMW10","Advance Exit (Overhead)","IMW",{"$f":"INDEX(sign_class[],MATCH(sign_type[[#This Row],[sign_class_code]],sign_class[sign_class_code],0),2)","v":"Information Motorway"}]
[null,null,null,null,null,null,null,"IMW06","Bus LANE \"__\" (Specified time)","IMW",{"$f":"INDEX(sign_class[],MATCH(sign_type[[#This Row],[sign_class_code]],sign_class[sign_class_code],0),2)","v":"Information Motorway"}]
[null,null,null,null,null,null,null,"IMW04","Bus LANE AHEAD","IMW",{"$f":"INDEX(sign_class[],MATCH(sign_type[[#This Row],[sign_class_code]],sign_class[sign_class_code],0),2)","v":"Information Motorway"}]
[null,null,null,null,null,null,null,"IMW05","Bus LANE ENDS","IMW",{"$f":"INDEX(sign_class[],MATCH(sign_type[[#This Row],[sign_class_code]],sign_class[sign_class_code],0),2)","v":"Information Motorway"}]
[null,null,null,null,null,null,null,"IMW20","Confirmatory Destination","IMW",{"$f":"INDEX(sign_class[],MATCH(sign_type[[#This Row],[sign_class_code]],sign_class[sign_class_code],0),2)","v":"Information Motorway"}]
[null,null,null,null,null,null,null,"IMW03","EXIT","IMW",{"$f":"INDEX(sign_class[],MATCH(sign_type[[#This Row],[sign_class_code]],sign_class[sign_class_code],0),2)","v":"Information Motorway"}]
[null,null,null,null,null,null,null,"IMW12","Exit (Overhead)","IMW",{"$f":"INDEX(sign_class[],MATCH(sign_type[[#This Row],[sign_class_code]],sign_class[sign_class_code],0),2)","v":"Information Motorway"}]
[null,null,null,null,null,null,null,"IMW02","Exit Direction","IMW",{"$f":"INDEX(sign_class[],MATCH(sign_type[[#This Row],[sign_class_code]],sign_class[sign_class_code],0),2)","v":"Information Motorway"}]
[null,null,null,null,null,null,null,"IMW11","Exit Direction (Overhead)","IMW",{"$f":"INDEX(sign_class[],MATCH(sign_type[[#This Row],[sign_class_code]],sign_class[sign_class_code],0),2)","v":"Information Motorway"}]
[null,null,null,null,null,null,null,"IMW33","MOTORWAY (ramp)","IMW",{"$f":"INDEX(sign_class[],MATCH(sign_type[[#This Row],[sign_class_code]],sign_class[sign_class_code],0),2)","v":"Information Motorway"}]
[null,null,null,null,null,null,null,"IMW30","MOTORWAY BEGINS","IMW",{"$f":"INDEX(sign_class[],MATCH(sign_type[[#This Row],[sign_class_code]],sign_class[sign_class_code],0),2)","v":"Information Motorway"}]
[null,null,null,null,null,null,null,"IMW32","MOTORWAY ENDS","IMW",{"$f":"INDEX(sign_class[],MATCH(sign_type[[#This Row],[sign_class_code]],sign_class[sign_class_code],0),2)","v":"Information Motorway"}]
[null,null,null,null,null,null,null,"IMW34","MOTORWAY ENDS (ramp)","IMW",{"$f":"INDEX(sign_class[],MATCH(sign_type[[#This Row],[sign_class_code]],sign_class[sign_class_code],0),2)","v":"Information Motorway"}]
[null,null,null,null,null,null,null,"IMW31","MOTORWAY ENDS 400 m","IMW",{"$f":"INDEX(sign_class[],MATCH(sign_type[[#This Row],[sign_class_code]],sign_class[sign_class_code],0),2)","v":"Information Motorway"}]
[null,null,null,null,null,null,null,"MI-25.1","Supplementary Exit Number Plate - Ground Mounted","IMW",{"$f":"INDEX(sign_class[],MATCH(sign_type[[#This Row],[sign_class_code]],sign_class[sign_class_code],0),2)","v":"Information Motorway"}]
[null,null,null,null,null,null,null,"MI-25.2","Supplementary Exit Number Plate - Overhead Mounted","IMW",{"$f":"INDEX(sign_class[],MATCH(sign_type[[#This Row],[sign_class_code]],sign_class[sign_class_code],0),2)","v":"Information Motorway"}]
[null,null,null,null,null,null,null,"PW25-30","Curve Advisory Speed 30km/h","LA",{"$f":"INDEX(sign_class[],MATCH(sign_type[[#This Row],[sign_class_code]],sign_class[sign_class_code],0),2)","v":"Local Authority"}]
[null,null,null,null,null,null,null,"PW25-40","Curve Advisory Speed 40km/h","LA",{"$f":"INDEX(sign_class[],MATCH(sign_type[[#This Row],[sign_class_code]],sign_class[sign_class_code],0),2)","v":"Local Authority"}]
[null,null,null,null,null,null,null,"PW25-60","Curve Advisory Speed 60km/h","LA",{"$f":"INDEX(sign_class[],MATCH(sign_type[[#This Row],[sign_class_code]],sign_class[sign_class_code],0),2)","v":"Local Authority"}]
[null,null,null,null,null,null,null,"RG99","Engine Braking Restriction","LA",{"$f":"INDEX(sign_class[],MATCH(sign_type[[#This Row],[sign_class_code]],sign_class[sign_class_code],0),2)","v":"Local Authority"}]
[null,null,null,null,null,null,null,"PW70","EXTREME CARE","LA",{"$f":"INDEX(sign_class[],MATCH(sign_type[[#This Row],[sign_class_code]],sign_class[sign_class_code],0),2)","v":"Local Authority"}]
[null,null,null,null,null,null,null,"LR-BSN","Bridge serial number","LR",{"$f":"INDEX(sign_class[],MATCH(sign_type[[#This Row],[sign_class_code]],sign_class[sign_class_code],0),2)","v":"Location Referencing (LRMS)"}]
[null,null,null,null,null,null,null,"LR-CSN","Culvert Serial Number","LR",{"$f":"INDEX(sign_class[],MATCH(sign_type[[#This Row],[sign_class_code]],sign_class[sign_class_code],0),2)","v":"Location Referencing (LRMS)"}]
[null,null,null,null,null,null,null,"LR-ERP","Established Route Position","LR",{"$f":"INDEX(sign_class[],MATCH(sign_type[[#This Row],[sign_class_code]],sign_class[sign_class_code],0),2)","v":"Location Referencing (LRMS)"}]
[null,null,null,null,null,null,null,"LR-KMP","Kilometre Marker Post","LR",{"$f":"INDEX(sign_class[],MATCH(sign_type[[#This Row],[sign_class_code]],sign_class[sign_class_code],0),2)","v":"Location Referencing (LRMS)"}]
[null,null,null,null,null,null,null,"LR-RSR","Ramp Reference Station","LR",{"$f":"INDEX(sign_class[],MATCH(sign_type[[#This Row],[sign_class_code]],sign_class[sign_class_code],0),2)","v":"Location Referencing (LRMS)"}]
[null,null,null,null,null,null,null,"LR-RS","Reference Station","LR",{"$f":"INDEX(sign_class[],MATCH(sign_type[[#This Row],[sign_class_code]],sign_class[sign_class_code],0),2)","v":"Location Referencing (LRMS)"}]
[null,null,null,null,null,null,null,"LR-RSW","Roundabout Reference","LR",{"$f":"INDEX(sign_class[],MATCH(sign_type[[#This Row],[sign_class_code]],sign_class[sign_class_code],0),2)","v":"Location Referencing (LRMS)"}]
[null,null,null,null,null,null,null,"LR-TSN","Tunnel Serial Number","LR",{"$f":"INDEX(sign_class[],MATCH(sign_type[[#This Row],[sign_class_code]],sign_class[sign_class_code],0),2)","v":"Location Referencing (LRMS)"}]
[null,null,null,null,null,null,null,"AAH","Adopt A Highway","M",{"$f":"INDEX(sign_class[],MATCH(sign_type[[#This Row],[sign_class_code]],sign_class[sign_class_code],0),2)","v":"Miscellaneous"}]
[null,null,null,null,null,null,null,"BSM","Benchmark Site Marker","M",{"$f":"INDEX(sign_class[],MATCH(sign_type[[#This Row],[sign_class_code]],sign_class[sign_class_code],0),2)","v":"Miscellaneous"}]
[null,null,null,null,null,null,null,"BRP","Bridge Route Position","M",{"$f":"INDEX(sign_class[],MATCH(sign_type[[#This Row],[sign_class_code]],sign_class[sign_class_code],0),2)","v":"Miscellaneous"}]
[null,null,null,null,null,null,null,"CSM","Calibration Site Marker","M",{"$f":"INDEX(sign_class[],MATCH(sign_type[[#This Row],[sign_class_code]],sign_class[sign_class_code],0),2)","v":"Miscellaneous"}]
[null,null,null,null,null,null,null,"CSS","Calibration Site Sign","M",{"$f":"INDEX(sign_class[],MATCH(sign_type[[#This Row],[sign_class_code]],sign_class[sign_class_code],0),2)","v":"Miscellaneous"}]
[null,null,null,null,null,null,null,"CPM","Culvert Position Marker","M",{"$f":"INDEX(sign_class[],MATCH(sign_type[[#This Row],[sign_class_code]],sign_class[sign_class_code],0),2)","v":"Miscellaneous"}]
[null,null,null,null,null,null,null,"DOC","Department of Conservation","M",{"$f":"INDEX(sign_class[],MATCH(sign_type[[#This Row],[sign_class_code]],sign_class[sign_class_code],0),2)","v":"Miscellaneous"}]
[null,null,null,null,null,null,null,"DRP","Dumping of Rubbish Prohibited","M",{"$f":"INDEX(sign_class[],MATCH(sign_type[[#This Row],[sign_class_code]],sign_class[sign_class_code],0),2)","v":"Miscellaneous"}]
[null,null,null,null,null,null,null,"FH","Fire Hazard (Grapefruit sign)","M",{"$f":"INDEX(sign_class[],MATCH(sign_type[[#This Row],[sign_class_code]],sign_class[sign_class_code],0),2)","v":"Miscellaneous"}]
[null,null,null,null,null,null,null,"LNF","LIGHT NO FIRES","M",{"$f":"INDEX(sign_class[],MATCH(sign_type[[#This Row],[sign_class_code]],sign_class[sign_class_code],0),2)","v":"Miscellaneous"}]
[null,null,null,null,null,null,null,"OM","Obstruction Marker","M",{"$f":"INDEX(sign_class[],MATCH(sign_type[[#This Row],[sign_class_code]],sign_class[sign_class_code],0),2)","v":"Miscellaneous"}]
[null,null,null,null,null,null,null,"RS","Reference Station","M",{"$f":"INDEX(sign_class[],MATCH(sign_type[[#This Row],[sign_class_code]],sign_class[sign_class_code],0),2)","v":"Miscellaneous"}]
[null,null,null,null,null,null,null,"RPM","Route Position Marker","M",{"$f":"INDEX(sign_class[],MATCH(sign_type[[#This Row],[sign_class_code]],sign_class[sign_class_code],0),2)","v":"Miscellaneous"}]
[null,null,null,null,null,null,null,"SR","Sight Rail","M",{"$f":"INDEX(sign_class[],MATCH(sign_type[[#This Row],[sign_class_code]],sign_class[sign_class_code],0),2)","v":"Miscellaneous"}]
[null,null,null,null,null,null,null,"SDM","Subsoil Drain Marker","M",{"$f":"INDEX(sign_class[],MATCH(sign_type[[#This Row],[sign_class_code]],sign_class[sign_class_code],0),2)","v":"Miscellaneous"}]
[null,null,null,null,null,null,null,"SP1","Supplementary plate - \"200\"","M",{"$f":"INDEX(sign_class[],MATCH(sign_type[[#This Row],[sign_class_code]],sign_class[sign_class_code],0),2)","v":"Miscellaneous"}]
[null,null,null,null,null,null,null,"SP2","Supplementary plate \"<-->\"","M",{"$f":"INDEX(sign_class[],MATCH(sign_type[[#This Row],[sign_class_code]],sign_class[sign_class_code],0),2)","v":"Miscellaneous"}]
[null,null,null,null,null,null,null,"MS1.4","Four services \"__\"m ON left/right","MS",{"$f":"INDEX(sign_class[],MATCH(sign_type[[#This Row],[sign_class_code]],sign_class[sign_class_code],0),2)","v":"Motorist Services"}]
[null,null,null,null,null,null,null,"MS2.4","Four services TURN left/right \"__\"m","MS",{"$f":"INDEX(sign_class[],MATCH(sign_type[[#This Row],[sign_class_code]],sign_class[sign_class_code],0),2)","v":"Motorist Services"}]
[null,null,null,null,null,null,null,"MS4.4","Four services with arrow","MS",{"$f":"INDEX(sign_class[],MATCH(sign_type[[#This Row],[sign_class_code]],sign_class[sign_class_code],0),2)","v":"Motorist Services"}]
[null,null,null,null,null,null,null,"MS3.4","Four services with chevron","MS",{"$f":"INDEX(sign_class[],MATCH(sign_type[[#This Row],[sign_class_code]],sign_class[sign_class_code],0),2)","v":"Motorist Services"}]
[null,null,null,null,null,null,null,"MSS6","Motorist Fuel Sign 'NEXT KM'","MS",{"$f":"INDEX(sign_class[],MATCH(sign_type[[#This Row],[sign_class_code]],sign_class[sign_class_code],0),2)","v":"Motorist Services"}]
[null,null,null,null,null,null,null,"MS1.1","One service \"__\"m ON left/right","MS",{"$f":"INDEX(sign_class[],MATCH(sign_type[[#This Row],[sign_class_code]],sign_class[sign_class_code],0),2)","v":"Motorist Services"}]
[null,null,null,null,null,null,null,"MS2.1","One service TURN left/right \"__\"m","MS",{"$f":"INDEX(sign_class[],MATCH(sign_type[[#This Row],[sign_class_code]],sign_class[sign_class_code],0),2)","v":"Motorist Services"}]
[null,null,null,null,null,null,null,"MS4.1","One service with arrow","MS",{"$f":"INDEX(sign_class[],MATCH(sign_type[[#This Row],[sign_class_code]],sign_class[sign_class_code],0),2)","v":"Motorist Services"}]
[null,null,null,null,null,null,null,"MS3.1","One service with chevron","MS",{"$f":"INDEX(sign_class[],MATCH(sign_type[[#This Row],[sign_class_code]],sign_class[sign_class_code],0),2)","v":"Motorist Services"}]
[null,null,null,null,null,null,null,"MSR","Radio Information","MS",{"$f":"INDEX(sign_class[],MATCH(sign_type[[#This Row],[sign_class_code]],sign_class[sign_class_code],0),2)","v":"Motorist Services"}]
[null,null,null,null,null,null,null,"MS1.3","Three services \"__\"m ON left/right","MS",{"$f":"INDEX(sign_class[],MATCH(sign_type[[#This Row],[sign_class_code]],sign_class[sign_class_code],0),2)","v":"Motorist Services"}]
[null,null,null,null,null,null,null,"MS2.3","Three services TURN left/right \"__\"m","MS",{"$f":"INDEX(sign_class[],MATCH(sign_type[[#This Row],[sign_class_code]],sign_class[sign_class_code],0),2)","v":"Motorist Services"}]
[null,null,null,null,null,null,null,"MS4.3","Three services with arrow","MS",{"$f":"INDEX(sign_class[],MATCH(sign_type[[#This Row],[sign_class_code]],sign_class[sign_class_code],0),2)","v":"Motorist Services"}]
[null,null,null,null,null,null,null,"MS3.3","Three services with chevron","MS",{"$f":"INDEX(sign_class[],MATCH(sign_type[[#This Row],[sign_class_code]],sign_class[sign_class_code],0),2)","v":"Motorist Services"}]
[null,null,null,null,null,null,null,"MS1.2","Two services \"__\"m ON left/right","MS",{"$f":"INDEX(sign_class[],MATCH(sign_type[[#This Row],[sign_class_code]],sign_class[sign_class_code],0),2)","v":"Motorist Services"}]
[null,null,null,null,null,null,null,"MS2.2","Two services TURN left/right \"__\"m","MS",{"$f":"INDEX(sign_class[],MATCH(sign_type[[#This Row],[sign_class_code]],sign_class[sign_class_code],0),2)","v":"Motorist Services"}]
[null,null,null,null,null,null,null,"MS4.2","Two services with arrow","MS",{"$f":"INDEX(sign_class[],MATCH(sign_type[[#This Row],[sign_class_code]],sign_class[sign_class_code],0),2)","v":"Motorist Services"}]
[null,null,null,null,null,null,null,"MS3.2","Two services with chevron","MS",{"$f":"INDEX(sign_class[],MATCH(sign_type[[#This Row],[sign_class_code]],sign_class[sign_class_code],0),2)","v":"Motorist Services"}]
[null,null,null,null,null,null,null,"O-OS2","Obsolete Sign (DETOUR)","OS",{"$f":"INDEX(sign_class[],MATCH(sign_type[[#This Row],[sign_class_code]],sign_class[sign_class_code],0),2)","v":"Obsolete signs"}]
[null,null,null,null,null,null,null,"OS2","Obsolete Sign (DETOUR)","OS",{"$f":"INDEX(sign_class[],MATCH(sign_type[[#This Row],[sign_class_code]],sign_class[sign_class_code],0),2)","v":"Obsolete signs"}]
[null,null,null,null,null,null,null,"O-OS3","Obsolete Sign (NO FISHING FROM BRIDGE)","OS",{"$f":"INDEX(sign_class[],MATCH(sign_type[[#This Row],[sign_class_code]],sign_class[sign_class_code],0),2)","v":"Obsolete signs"}]
[null,null,null,null,null,null,null,"OS3","Obsolete Sign (NO FISHING FROM BRIDGE)","OS",{"$f":"INDEX(sign_class[],MATCH(sign_type[[#This Row],[sign_class_code]],sign_class[sign_class_code],0),2)","v":"Obsolete signs"}]
[null,null,null,null,null,null,null,"OS6","Obsolete Sign (Road Ends)","OS",{"$f":"INDEX(sign_class[],MATCH(sign_type[[#This Row],[sign_class_code]],sign_class[sign_class_code],0),2)","v":"Obsolete signs"}]
[null,null,null,null,null,null,null,"O-OS5","Obsolete sign (STOP FOR RED SIGNAL)","OS",{"$f":"INDEX(sign_class[],MATCH(sign_type[[#This Row],[sign_class_code]],sign_class[sign_class_code],0),2)","v":"Obsolete signs"}]
[null,null,null,null,null,null,null,"OS5","Obsolete sign (STOP FOR RED SIGNAL)","OS",{"$f":"INDEX(sign_class[],MATCH(sign_type[[#This Row],[sign_class_code]],sign_class[sign_class_code],0),2)","v":"Obsolete signs"}]
[null,null,null,null,null,null,null,"O-OS4","Obsolete Sign (THREE LANE ROAD)","OS",{"$f":"INDEX(sign_class[],MATCH(sign_type[[#This Row],[sign_class_code]],sign_class[sign_class_code],0),2)","v":"Obsolete signs"}]
[null,null,null,null,null,null,null,"OS4","Obsolete Sign (THREE LANE ROAD)","OS",{"$f":"INDEX(sign_class[],MATCH(sign_type[[#This Row],[sign_class_code]],sign_class[sign_class_code],0),2)","v":"Obsolete signs"}]
[null,null,null,null,null,null,null,"O-OS1","Obsolete Sign (TRAFFIC ISLANDS)","OS",{"$f":"INDEX(sign_class[],MATCH(sign_type[[#This Row],[sign_class_code]],sign_class[sign_class_code],0),2)","v":"Obsolete signs"}]
[null,null,null,null,null,null,null,"OS1","Obsolete Sign (TRAFFIC ISLANDS)","OS",{"$f":"INDEX(sign_class[],MATCH(sign_type[[#This Row],[sign_class_code]],sign_class[sign_class_code],0),2)","v":"Obsolete signs"}]
[null,null,null,null,null,null,null,"PW51","Aircraft","PW",{"$f":"INDEX(sign_class[],MATCH(sign_type[[#This Row],[sign_class_code]],sign_class[sign_class_code],0),2)","v":"Permanent Warning"}]
[null,null,null,null,null,null,null,"PW65","Belisha Beacon Disk","PW",{"$f":"INDEX(sign_class[],MATCH(sign_type[[#This Row],[sign_class_code]],sign_class[sign_class_code],0),2)","v":"Permanent Warning"}]
[null,null,null,null,null,null,null,"PW65A","Belisha Beacon Internally Illuminated Globe","PW",{"$f":"INDEX(sign_class[],MATCH(sign_type[[#This Row],[sign_class_code]],sign_class[sign_class_code],0),2)","v":"Permanent Warning"}]
[null,null,null,null,null,null,null,"PW66","Chevron Board","PW",{"$f":"INDEX(sign_class[],MATCH(sign_type[[#This Row],[sign_class_code]],sign_class[sign_class_code],0),2)","v":"Permanent Warning"}]
[null,null,null,null,null,null,null,"PW66-15","Chevron Board - Advisory speed 15km/h","PW",{"$f":"INDEX(sign_class[],MATCH(sign_type[[#This Row],[sign_class_code]],sign_class[sign_class_code],0),2)","v":"Permanent Warning"}]
[null,null,null,null,null,null,null,"PW66-25","Chevron Board - Advisory speed 25km/h","PW",{"$f":"INDEX(sign_class[],MATCH(sign_type[[#This Row],[sign_class_code]],sign_class[sign_class_code],0),2)","v":"Permanent Warning"}]
[null,null,null,null,null,null,null,"PW66-35","Chevron Board - Advisory speed 35km/h","PW",{"$f":"INDEX(sign_class[],MATCH(sign_type[[#This Row],[sign_class_code]],sign_class[sign_class_code],0),2)","v":"Permanent Warning"}]
[null,null,null,null,null,null,null,"PW66-45","Chevron Board - Advisory speed 45km/h","PW",{"$f":"INDEX(sign_class[],MATCH(sign_type[[#This Row],[sign_class_code]],sign_class[sign_class_code],0),2)","v":"Permanent Warning"}]
[null,null,null,null,null,null,null,"PW66-55","Chevron Board - Advisory speed 55km/h","PW",{"$f":"INDEX(sign_class[],MATCH(sign_type[[#This Row],[sign_class_code]],sign_class[sign_class_code],0),2)","v":"Permanent Warning"}]
[null,null,null,null,null,null,null,"PW66-65","Chevron Board - Advisory speed 65km/h","PW",{"$f":"INDEX(sign_class[],MATCH(sign_type[[#This Row],[sign_class_code]],sign_class[sign_class_code],0),2)","v":"Permanent Warning"}]
[null,null,null,null,null,null,null,"PW66-75","Chevron Board - Advisory speed 75km/h","PW",{"$f":"INDEX(sign_class[],MATCH(sign_type[[#This Row],[sign_class_code]],sign_class[sign_class_code],0),2)","v":"Permanent Warning"}]
[null,null,null,null,null,null,null,"PW66-85","Chevron Board - Advisory speed 85km/h","PW",{"$f":"INDEX(sign_class[],MATCH(sign_type[[#This Row],[sign_class_code]],sign_class[sign_class_code],0),2)","v":"Permanent Warning"}]
[null,null,null,null,null,null,null,"PW66-95","Chevron Board - Advisory speed 95km/h","PW",{"$f":"INDEX(sign_class[],MATCH(sign_type[[#This Row],[sign_class_code]],sign_class[sign_class_code],0),2)","v":"Permanent Warning"}]
[null,null,null,null,null,null,null,"PW69","Chevron Board - Roundabouts","PW",{"$f":"INDEX(sign_class[],MATCH(sign_type[[#This Row],[sign_class_code]],sign_class[sign_class_code],0),2)","v":"Permanent Warning"}]
[null,null,null,null,null,null,null,"PW68","Chevron Board - T Intersections","PW",{"$f":"INDEX(sign_class[],MATCH(sign_type[[#This Row],[sign_class_code]],sign_class[sign_class_code],0),2)","v":"Permanent Warning"}]
[null,null,null,null,null,null,null,"PW67","Chevron Curve Indicator","PW",{"$f":"INDEX(sign_class[],MATCH(sign_type[[#This Row],[sign_class_code]],sign_class[sign_class_code],0),2)","v":"Permanent Warning"}]
[null,null,null,null,null,null,null,"PW31","Children","PW",{"$f":"INDEX(sign_class[],MATCH(sign_type[[#This Row],[sign_class_code]],sign_class[sign_class_code],0),2)","v":"Permanent Warning"}]
[null,null,null,null,null,null,null,"PW26","Concealed Exit On Curve","PW",{"$f":"INDEX(sign_class[],MATCH(sign_type[[#This Row],[sign_class_code]],sign_class[sign_class_code],0),2)","v":"Permanent Warning"}]
[null,null,null,null,null,null,null,"PW9","Cross Roads - Controlled (priority route ahead)","PW",{"$f":"INDEX(sign_class[],MATCH(sign_type[[#This Row],[sign_class_code]],sign_class[sign_class_code],0),2)","v":"Permanent Warning"}]
[null,null,null,null,null,null,null,"PW9.1","Cross Roads - Controlled (priority route turns)","PW",{"$f":"INDEX(sign_class[],MATCH(sign_type[[#This Row],[sign_class_code]],sign_class[sign_class_code],0),2)","v":"Permanent Warning"}]
[null,null,null,null,null,null,null,"PW17","Curve - 15 to 90 degrees","PW",{"$f":"INDEX(sign_class[],MATCH(sign_type[[#This Row],[sign_class_code]],sign_class[sign_class_code],0),2)","v":"Permanent Warning"}]
[null,null,null,null,null,null,null,"PW18","Curve - 90 to 120 degrees","PW",{"$f":"INDEX(sign_class[],MATCH(sign_type[[#This Row],[sign_class_code]],sign_class[sign_class_code],0),2)","v":"Permanent Warning"}]
[null,null,null,null,null,null,null,"PW19","Curve - Greater Than 120 degrees","PW",{"$f":"INDEX(sign_class[],MATCH(sign_type[[#This Row],[sign_class_code]],sign_class[sign_class_code],0),2)","v":"Permanent Warning"}]
[null,null,null,null,null,null,null,"PW25","Curve Advisory Speed (never erected separately)","PW",{"$f":"INDEX(sign_class[],MATCH(sign_type[[#This Row],[sign_class_code]],sign_class[sign_class_code],0),2)","v":"Permanent Warning"}]
[null,null,null,null,null,null,null,"PW25-15","Curve Advisory Speed 15km/h","PW",{"$f":"INDEX(sign_class[],MATCH(sign_type[[#This Row],[sign_class_code]],sign_class[sign_class_code],0),2)","v":"Permanent Warning"}]
[null,null,null,null,null,null,null,"PW25-25","Curve Advisory Speed 25km/h","PW",{"$f":"INDEX(sign_class[],MATCH(sign_type[[#This Row],[sign_class_code]],sign_class[sign_class_code],0),2)","v":"Permanent Warning"}]
[null,null,null,null,null,null,null,"PW25-35","Curve Advisory Speed 35km/h","PW",{"$f":"INDEX(sign_class[],MATCH(sign_type[[#This Row],[sign_class_code]],sign_class[sign_class_code],0),2)","v":"Permanent Warning"}]
[null,null,null,null,null,null,null,"PW25-45","Curve Advisory Speed 45km/h","PW",{"$f":"INDEX(sign_class[],MATCH(sign_type[[#This Row],[sign_class_code]],sign_class[sign_class_code],0),2)","v":"Permanent Warning"}]
[null,null,null,null,null,null,null,"PW25-55","Curve Advisory Speed 55km/h","PW",{"$f":"INDEX(sign_class[],MATCH(sign_type[[#This Row],[sign_class_code]],sign_class[sign_class_code],0),2)","v":"Permanent Warning"}]
[null,null,null,null,null,null,null,"PW25-05","Curve Advisory Speed 5km/h","PW",{"$f":"INDEX(sign_class[],MATCH(sign_type[[#This Row],[sign_class_code]],sign_class[sign_class_code],0),2)","v":"Permanent Warning"}]
[null,null,null,null,null,null,null,"PW25-65","Curve Advisory Speed 65km/h","PW",{"$f":"INDEX(sign_class[],MATCH(sign_type[[#This Row],[sign_class_code]],sign_class[sign_class_code],0),2)","v":"Permanent Warning"}]
[null,null,null,null,null,null,null,"PW25-75","Curve Advisory Speed 75km/h","PW",{"$f":"INDEX(sign_class[],MATCH(sign_type[[#This Row],[sign_class_code]],sign_class[sign_class_code],0),2)","v":"Permanent Warning"}]
[null,null,null,null,null,null,null,"PW25-85","Curve Advisory Speed 85km/h","PW",{"$f":"INDEX(sign_class[],MATCH(sign_type[[#This Row],[sign_class_code]],sign_class[sign_class_code],0),2)","v":"Permanent Warning"}]
[null,null,null,null,null,null,null,"PW25-95","Curve Advisory Speed 95km/h","PW",{"$f":"INDEX(sign_class[],MATCH(sign_type[[#This Row],[sign_class_code]],sign_class[sign_class_code],0),2)","v":"Permanent Warning"}]
[null,null,null,null,null,null,null,"PW35","Cyclists","PW",{"$f":"INDEX(sign_class[],MATCH(sign_type[[#This Row],[sign_class_code]],sign_class[sign_class_code],0),2)","v":"Permanent Warning"}]
[null,null,null,null,null,null,null,"PW5","Diverge","PW",{"$f":"INDEX(sign_class[],MATCH(sign_type[[#This Row],[sign_class_code]],sign_class[sign_class_code],0),2)","v":"Permanent Warning"}]
[null,null,null,null,null,null,null,"PW49","Fire Station","PW",{"$f":"INDEX(sign_class[],MATCH(sign_type[[#This Row],[sign_class_code]],sign_class[sign_class_code],0),2)","v":"Permanent Warning"}]
[null,null,null,null,null,null,null,"PW2","Give Way Ahead \"__\" m","PW",{"$f":"INDEX(sign_class[],MATCH(sign_type[[#This Row],[sign_class_code]],sign_class[sign_class_code],0),2)","v":"Permanent Warning"}]
[null,null,null,null,null,null,null,"PW64.1","Hidden Queue","PW",{"$f":"INDEX(sign_class[],MATCH(sign_type[[#This Row],[sign_class_code]],sign_class[sign_class_code],0),2)","v":"Permanent Warning"}]
[null,null,null,null,null,null,null,"PW36","Horses","PW",{"$f":"INDEX(sign_class[],MATCH(sign_type[[#This Row],[sign_class_code]],sign_class[sign_class_code],0),2)","v":"Permanent Warning"}]
[null,null,null,null,null,null,null,"PW39","Hump","PW",{"$f":"INDEX(sign_class[],MATCH(sign_type[[#This Row],[sign_class_code]],sign_class[sign_class_code],0),2)","v":"Permanent Warning"}]
[null,null,null,null,null,null,null,"PW99","Kiwi Crossing","PW",{"$f":"INDEX(sign_class[],MATCH(sign_type[[#This Row],[sign_class_code]],sign_class[sign_class_code],0),2)","v":"Permanent Warning"}]
[null,null,null,null,null,null,null,"PW43.3","Lane Reduction - 2 lanes to 1 lane","PW",{"$f":"INDEX(sign_class[],MATCH(sign_type[[#This Row],[sign_class_code]],sign_class[sign_class_code],0),2)","v":"Permanent Warning"}]
[null,null,null,null,null,null,null,"PW43.4","Lane Reduction - 3 lanes to 2 lanes","PW",{"$f":"INDEX(sign_class[],MATCH(sign_type[[#This Row],[sign_class_code]],sign_class[sign_class_code],0),2)","v":"Permanent Warning"}]
[null,null,null,null,null,null,null,"PW45","Low Clearance - Advance Warning","PW",{"$f":"INDEX(sign_class[],MATCH(sign_type[[#This Row],[sign_class_code]],sign_class[sign_class_code],0),2)","v":"Permanent Warning"}]
[null,null,null,null,null,null,null,"PW46","Low Clearance On Structure Or Tunnel","PW",{"$f":"INDEX(sign_class[],MATCH(sign_type[[#This Row],[sign_class_code]],sign_class[sign_class_code],0),2)","v":"Permanent Warning"}]
[null,null,null,null,null,null,null,"PW4","Merging Traffic","PW",{"$f":"INDEX(sign_class[],MATCH(sign_type[[#This Row],[sign_class_code]],sign_class[sign_class_code],0),2)","v":"Permanent Warning"}]
[null,null,null,null,null,null,null,"PW4A","Merging Traffic - lane gain","PW",{"$f":"INDEX(sign_class[],MATCH(sign_type[[#This Row],[sign_class_code]],sign_class[sign_class_code],0),2)","v":"Permanent Warning"}]
[null,null,null,null,null,null,null,"PW4B","Merging Traffic - left and right","PW",{"$f":"INDEX(sign_class[],MATCH(sign_type[[#This Row],[sign_class_code]],sign_class[sign_class_code],0),2)","v":"Permanent Warning"}]
[null,null,null,null,null,null,null,"PW44","Narrow Bridge","PW",{"$f":"INDEX(sign_class[],MATCH(sign_type[[#This Row],[sign_class_code]],sign_class[sign_class_code],0),2)","v":"Permanent Warning"}]
[null,null,null,null,null,null,null,"PW44.1","Narrow Bridge - CAUTION WIDE VEHICLES","PW",{"$f":"INDEX(sign_class[],MATCH(sign_type[[#This Row],[sign_class_code]],sign_class[sign_class_code],0),2)","v":"Permanent Warning"}]
[null,null,null,null,null,null,null,"PW55","Other Hazard - CATTLE STOP","PW",{"$f":"INDEX(sign_class[],MATCH(sign_type[[#This Row],[sign_class_code]],sign_class[sign_class_code],0),2)","v":"Permanent Warning"}]
[null,null,null,null,null,null,null,"PW54","Other Hazard - FORD","PW",{"$f":"INDEX(sign_class[],MATCH(sign_type[[#This Row],[sign_class_code]],sign_class[sign_class_code],0),2)","v":"Permanent Warning"}]
[null,null,null,null,null,null,null,"PW56","Other Hazard - GATE","PW",{"$f":"INDEX(sign_class[],MATCH(sign_type[[#This Row],[sign_class_code]],sign_class[sign_class_code],0),2)","v":"Permanent Warning"}]
[null,null,null,null,null,null,null,"PW53","Other Hazard (never erected separately)","PW",{"$f":"INDEX(sign_class[],MATCH(sign_type[[#This Row],[sign_class_code]],sign_class[sign_class_code],0),2)","v":"Permanent Warning"}]
[null,null,null,null,null,null,null,"PW47","Overhead Electric Cable (never erected separately)","PW",{"$f":"INDEX(sign_class[],MATCH(sign_type[[#This Row],[sign_class_code]],sign_class[sign_class_code],0),2)","v":"Permanent Warning"}]
[null,null,null,null,null,null,null,"PW30","Pedestrian Crossing","PW",{"$f":"INDEX(sign_class[],MATCH(sign_type[[#This Row],[sign_class_code]],sign_class[sign_class_code],0),2)","v":"Permanent Warning"}]
[null,null,null,null,null,null,null,"PW29","Pedestrians","PW",{"$f":"INDEX(sign_class[],MATCH(sign_type[[#This Row],[sign_class_code]],sign_class[sign_class_code],0),2)","v":"Permanent Warning"}]
[null,null,null,null,null,null,null,"PW64","Prepare to Stop","PW",{"$f":"INDEX(sign_class[],MATCH(sign_type[[#This Row],[sign_class_code]],sign_class[sign_class_code],0),2)","v":"Permanent Warning"}]
[null,null,null,null,null,null,null,"PW64.2","Queued Vehicles","PW",{"$f":"INDEX(sign_class[],MATCH(sign_type[[#This Row],[sign_class_code]],sign_class[sign_class_code],0),2)","v":"Permanent Warning"}]
[null,null,null,null,null,null,null,"PW15","RAILWAY \"__\" TRACKS","PW",{"$f":"INDEX(sign_class[],MATCH(sign_type[[#This Row],[sign_class_code]],sign_class[sign_class_code],0),2)","v":"Permanent Warning"}]
[null,null,null,null,null,null,null,"PW14","RAILWAY CROSSING","PW",{"$f":"INDEX(sign_class[],MATCH(sign_type[[#This Row],[sign_class_code]],sign_class[sign_class_code],0),2)","v":"Permanent Warning"}]
[null,null,null,null,null,null,null,"PW13.2","Railway Crossing At Tee Junction - Controlled","PW",{"$f":"INDEX(sign_class[],MATCH(sign_type[[#This Row],[sign_class_code]],sign_class[sign_class_code],0),2)","v":"Permanent Warning"}]
[null,null,null,null,null,null,null,"PW13.3","Railway Crossing At Tee Junction - Uncontrolled","PW",{"$f":"INDEX(sign_class[],MATCH(sign_type[[#This Row],[sign_class_code]],sign_class[sign_class_code],0),2)","v":"Permanent Warning"}]
[null,null,null,null,null,null,null,"PW13","Railway Crossing On Side Road - Controlled","PW",{"$f":"INDEX(sign_class[],MATCH(sign_type[[#This Row],[sign_class_code]],sign_class[sign_class_code],0),2)","v":"Permanent Warning"}]
[null,null,null,null,null,null,null,"PW13.1","Railway Crossing On Side Road - Uncontrolled","PW",{"$f":"INDEX(sign_class[],MATCH(sign_type[[#This Row],[sign_class_code]],sign_class[sign_class_code],0),2)","v":"Permanent Warning"}]
[null,null,null,null,null,null,null,"PW57.1","Railway Level Crossing \"__\" Ahead","PW",{"$f":"INDEX(sign_class[],MATCH(sign_type[[#This Row],[sign_class_code]],sign_class[sign_class_code],0),2)","v":"Permanent Warning"}]
[null,null,null,null,null,null,null,"PW59","Railway Level Crossing \"LOOK FOR TRAINS\"","PW",{"$f":"INDEX(sign_class[],MATCH(sign_type[[#This Row],[sign_class_code]],sign_class[sign_class_code],0),2)","v":"Permanent Warning"}]
[null,null,null,null,null,null,null,"PW60.2","Railway Level Crossing at an Oblique Angle","PW",{"$f":"INDEX(sign_class[],MATCH(sign_type[[#This Row],[sign_class_code]],sign_class[sign_class_code],0),2)","v":"Permanent Warning"}]
[null,null,null,null,null,null,null,"PW60.1","Railway Level Crossing at an Oblique Angle","PW",{"$f":"INDEX(sign_class[],MATCH(sign_type[[#This Row],[sign_class_code]],sign_class[sign_class_code],0),2)","v":"Permanent Warning"}]
[null,null,null,null,null,null,null,"PW58","Railway Level Crossing FLashing Light Signals Ahead","PW",{"$f":"INDEX(sign_class[],MATCH(sign_type[[#This Row],[sign_class_code]],sign_class[sign_class_code],0),2)","v":"Permanent Warning"}]
[null,null,null,null,null,null,null,"PW61","Railway Level Crossing Intermediate Advance Warning","PW",{"$f":"INDEX(sign_class[],MATCH(sign_type[[#This Row],[sign_class_code]],sign_class[sign_class_code],0),2)","v":"Permanent Warning"}]
[null,null,null,null,null,null,null,"PW62","Railway Level Crossing on a Side Road Advance Warning","PW",{"$f":"INDEX(sign_class[],MATCH(sign_type[[#This Row],[sign_class_code]],sign_class[sign_class_code],0),2)","v":"Permanent Warning"}]
[null,null,null,null,null,null,null,"PW60","Railway Level Crossing Substantially at a Right Angle","PW",{"$f":"INDEX(sign_class[],MATCH(sign_type[[#This Row],[sign_class_code]],sign_class[sign_class_code],0),2)","v":"Permanent Warning"}]
[null,null,null,null,null,null,null,"PW22","Reverse Curve - Decreasing Radii","PW",{"$f":"INDEX(sign_class[],MATCH(sign_type[[#This Row],[sign_class_code]],sign_class[sign_class_code],0),2)","v":"Permanent Warning"}]
[null,null,null,null,null,null,null,"PW21","Reverse Curve - Greater Than 60 degrees","PW",{"$f":"INDEX(sign_class[],MATCH(sign_type[[#This Row],[sign_class_code]],sign_class[sign_class_code],0),2)","v":"Permanent Warning"}]
[null,null,null,null,null,null,null,"PW20","Reverse Curve - Less Than 60 degrees","PW",{"$f":"INDEX(sign_class[],MATCH(sign_type[[#This Row],[sign_class_code]],sign_class[sign_class_code],0),2)","v":"Permanent Warning"}]
[null,null,null,null,null,null,null,"PW23","Reverse Curves (less than 1km in extent)","PW",{"$f":"INDEX(sign_class[],MATCH(sign_type[[#This Row],[sign_class_code]],sign_class[sign_class_code],0),2)","v":"Permanent Warning"}]
[null,null,null,null,null,null,null,"PW43.1","Road Narrows (Both Sides Narrowing)","PW",{"$f":"INDEX(sign_class[],MATCH(sign_type[[#This Row],[sign_class_code]],sign_class[sign_class_code],0),2)","v":"Permanent Warning"}]
[null,null,null,null,null,null,null,"PW43","Road Narrows (Left or Right Side Narrowing)","PW",{"$f":"INDEX(sign_class[],MATCH(sign_type[[#This Row],[sign_class_code]],sign_class[sign_class_code],0),2)","v":"Permanent Warning"}]
[null,null,null,null,null,null,null,"PW43.2","Road Narrows Ahead \"__\"m","PW",{"$f":"INDEX(sign_class[],MATCH(sign_type[[#This Row],[sign_class_code]],sign_class[sign_class_code],0),2)","v":"Permanent Warning"}]
[null,null,null,null,null,null,null,"PW8","Rotary Junction","PW",{"$f":"INDEX(sign_class[],MATCH(sign_type[[#This Row],[sign_class_code]],sign_class[sign_class_code],0),2)","v":"Permanent Warning"}]
[null,null,null,null,null,null,null,"PW32","SCHOOL","PW",{"$f":"INDEX(sign_class[],MATCH(sign_type[[#This Row],[sign_class_code]],sign_class[sign_class_code],0),2)","v":"Permanent Warning"}]
[null,null,null,null,null,null,null,"PW34","SCHOOL BUS ROUTE","PW",{"$f":"INDEX(sign_class[],MATCH(sign_type[[#This Row],[sign_class_code]],sign_class[sign_class_code],0),2)","v":"Permanent Warning"}]
[null,null,null,null,null,null,null,"PW34A","SCHOOL BUS TURNS","PW",{"$f":"INDEX(sign_class[],MATCH(sign_type[[#This Row],[sign_class_code]],sign_class[sign_class_code],0),2)","v":"Permanent Warning"}]
[null,null,null,null,null,null,null,"PW33","SCHOOL Crossing","PW",{"$f":"INDEX(sign_class[],MATCH(sign_type[[#This Row],[sign_class_code]],sign_class[sign_class_code],0),2)","v":"Permanent Warning"}]
[null,null,null,null,null,null,null,"PW16","Sharp Curve - Approx 90 degrees","PW",{"$f":"INDEX(sign_class[],MATCH(sign_type[[#This Row],[sign_class_code]],sign_class[sign_class_code],0),2)","v":"Permanent Warning"}]
[null,null,null,null,null,null,null,"PW11","Side Road Junction - Controlled","PW",{"$f":"INDEX(sign_class[],MATCH(sign_type[[#This Row],[sign_class_code]],sign_class[sign_class_code],0),2)","v":"Permanent Warning"}]
[null,null,null,null,null,null,null,"PW11.1","Side Road Junction - Uncontrolled","PW",{"$f":"INDEX(sign_class[],MATCH(sign_type[[#This Row],[sign_class_code]],sign_class[sign_class_code],0),2)","v":"Permanent Warning"}]
[null,null,null,null,null,null,null,"PW41.3","Slippery Surface - GRAVEL ROAD","PW",{"$f":"INDEX(sign_class[],MATCH(sign_type[[#This Row],[sign_class_code]],sign_class[sign_class_code],0),2)","v":"Permanent Warning"}]
[null,null,null,null,null,null,null,"PW41.1","Slippery Surface - WHEN FROSTY","PW",{"$f":"INDEX(sign_class[],MATCH(sign_type[[#This Row],[sign_class_code]],sign_class[sign_class_code],0),2)","v":"Permanent Warning"}]
[null,null,null,null,null,null,null,"PW41.1A","Slippery surface - WHEN FROSTY - next\"__\"km","PW",{"$f":"INDEX(sign_class[],MATCH(sign_type[[#This Row],[sign_class_code]],sign_class[sign_class_code],0),2)","v":"Permanent Warning"}]
[null,null,null,null,null,null,null,"PW41.2","Slippery Surface - WHEN WET","PW",{"$f":"INDEX(sign_class[],MATCH(sign_type[[#This Row],[sign_class_code]],sign_class[sign_class_code],0),2)","v":"Permanent Warning"}]
[null,null,null,null,null,null,null,"PW41","Slippery Surface (never erected separately)","PW",{"$f":"INDEX(sign_class[],MATCH(sign_type[[#This Row],[sign_class_code]],sign_class[sign_class_code],0),2)","v":"Permanent Warning"}]
[null,null,null,null,null,null,null,"PW42","Slips/Falling Debris","PW",{"$f":"INDEX(sign_class[],MATCH(sign_type[[#This Row],[sign_class_code]],sign_class[sign_class_code],0),2)","v":"Permanent Warning"}]
[null,null,null,null,null,null,null,"PW1-3.1","SPEED LIMIT AHEAD 10 KM/H","PW",{"$f":"INDEX(sign_class[],MATCH(sign_type[[#This Row],[sign_class_code]],sign_class[sign_class_code],0),2)","v":"Permanent Warning"}]
[null,null,null,null,null,null,null,"PW1-3.2","SPEED LIMIT AHEAD 20 KM/H","PW",{"$f":"INDEX(sign_class[],MATCH(sign_type[[#This Row],[sign_class_code]],sign_class[sign_class_code],0),2)","v":"Permanent Warning"}]
[null,null,null,null,null,null,null,"PW1-3.3","SPEED LIMIT AHEAD 30 KM/H","PW",{"$f":"INDEX(sign_class[],MATCH(sign_type[[#This Row],[sign_class_code]],sign_class[sign_class_code],0),2)","v":"Permanent Warning"}]
[null,null,null,null,null,null,null,"PW1-3.4","SPEED LIMIT AHEAD 40 KM/H","PW",{"$f":"INDEX(sign_class[],MATCH(sign_type[[#This Row],[sign_class_code]],sign_class[sign_class_code],0),2)","v":"Permanent Warning"}]
[null,null,null,null,null,null,null,"PW1-3.5","SPEED LIMIT AHEAD 50KM/H","PW",{"$f":"INDEX(sign_class[],MATCH(sign_type[[#This Row],[sign_class_code]],sign_class[sign_class_code],0),2)","v":"Permanent Warning"}]
[null,null,null,null,null,null,null,"PW1-3.6","SPEED LIMIT AHEAD 60 KM/H","PW",{"$f":"INDEX(sign_class[],MATCH(sign_type[[#This Row],[sign_class_code]],sign_class[sign_class_code],0),2)","v":"Permanent Warning"}]
[null,null,null,null,null,null,null,"PW1-3.7","SPEED LIMIT AHEAD 70 KM/H","PW",{"$f":"INDEX(sign_class[],MATCH(sign_type[[#This Row],[sign_class_code]],sign_class[sign_class_code],0),2)","v":"Permanent Warning"}]
[null,null,null,null,null,null,null,"PW1-3.8","SPEED LIMIT AHEAD 80 KM/H","PW",{"$f":"INDEX(sign_class[],MATCH(sign_type[[#This Row],[sign_class_code]],sign_class[sign_class_code],0),2)","v":"Permanent Warning"}]
[null,null,null,null,null,null,null,"PW1-3.9","SPEED LIMIT AHEAD 90 KM/H","PW",{"$f":"INDEX(sign_class[],MATCH(sign_type[[#This Row],[sign_class_code]],sign_class[sign_class_code],0),2)","v":"Permanent Warning"}]
[null,null,null,null,null,null,null,"PW27","Steep Grade - Downgrade","PW",{"$f":"INDEX(sign_class[],MATCH(sign_type[[#This Row],[sign_class_code]],sign_class[sign_class_code],0),2)","v":"Permanent Warning"}]
[null,null,null,null,null,null,null,"PW27.1","Steep Grade - Upgrade","PW",{"$f":"INDEX(sign_class[],MATCH(sign_type[[#This Row],[sign_class_code]],sign_class[sign_class_code],0),2)","v":"Permanent Warning"}]
[null,null,null,null,null,null,null,"PW37","Stock (Cattle)","PW",{"$f":"INDEX(sign_class[],MATCH(sign_type[[#This Row],[sign_class_code]],sign_class[sign_class_code],0),2)","v":"Permanent Warning"}]
[null,null,null,null,null,null,null,"PW37.1","Stock (Sheep)","PW",{"$f":"INDEX(sign_class[],MATCH(sign_type[[#This Row],[sign_class_code]],sign_class[sign_class_code],0),2)","v":"Permanent Warning"}]
[null,null,null,null,null,null,null,"PW1","Stop Ahead \"__\" m","PW",{"$f":"INDEX(sign_class[],MATCH(sign_type[[#This Row],[sign_class_code]],sign_class[sign_class_code],0),2)","v":"Permanent Warning"}]
[null,null,null,null,null,null,null,"PW38","Sudden Dip","PW",{"$f":"INDEX(sign_class[],MATCH(sign_type[[#This Row],[sign_class_code]],sign_class[sign_class_code],0),2)","v":"Permanent Warning"}]
[null,null,null,null,null,null,null,"PW10","Tee Junction - Controlled","PW",{"$f":"INDEX(sign_class[],MATCH(sign_type[[#This Row],[sign_class_code]],sign_class[sign_class_code],0),2)","v":"Permanent Warning"}]
[null,null,null,null,null,null,null,"PW10.1","Tee Junction - Uncontrolled","PW",{"$f":"INDEX(sign_class[],MATCH(sign_type[[#This Row],[sign_class_code]],sign_class[sign_class_code],0),2)","v":"Permanent Warning"}]
[null,null,null,null,null,null,null,"PW3","Traffic Signals","PW",{"$f":"INDEX(sign_class[],MATCH(sign_type[[#This Row],[sign_class_code]],sign_class[sign_class_code],0),2)","v":"Permanent Warning"}]
[null,null,null,null,null,null,null,"PW57","Train","PW",{"$f":"INDEX(sign_class[],MATCH(sign_type[[#This Row],[sign_class_code]],sign_class[sign_class_code],0),2)","v":"Permanent Warning"}]
[null,null,null,null,null,null,null,"PW63","Tram","PW",{"$f":"INDEX(sign_class[],MATCH(sign_type[[#This Row],[sign_class_code]],sign_class[sign_class_code],0),2)","v":"Permanent Warning"}]
[null,null,null,null,null,null,null,"PW50","Trucks","PW",{"$f":"INDEX(sign_class[],MATCH(sign_type[[#This Row],[sign_class_code]],sign_class[sign_class_code],0),2)","v":"Permanent Warning"}]
[null,null,null,null,null,null,null,"PW28","TRUCKS USE LOW GEAR (PW27 Supplementary)","PW",{"$f":"INDEX(sign_class[],MATCH(sign_type[[#This Row],[sign_class_code]],sign_class[sign_class_code],0),2)","v":"Permanent Warning"}]
[null,null,null,null,null,null,null,"PW52","Tunnel","PW",{"$f":"INDEX(sign_class[],MATCH(sign_type[[#This Row],[sign_class_code]],sign_class[sign_class_code],0),2)","v":"Permanent Warning"}]
[null,null,null,null,null,null,null,"PW6","Two Way","PW",{"$f":"INDEX(sign_class[],MATCH(sign_type[[#This Row],[sign_class_code]],sign_class[sign_class_code],0),2)","v":"Permanent Warning"}]
[null,null,null,null,null,null,null,"PW7","Two Way Ahead \"__\" m","PW",{"$f":"INDEX(sign_class[],MATCH(sign_type[[#This Row],[sign_class_code]],sign_class[sign_class_code],0),2)","v":"Permanent Warning"}]
[null,null,null,null,null,null,null,"PW40","Uneven Surface","PW",{"$f":"INDEX(sign_class[],MATCH(sign_type[[#This Row],[sign_class_code]],sign_class[sign_class_code],0),2)","v":"Permanent Warning"}]
[null,null,null,null,null,null,null,"PW48","Wind Gusts","PW",{"$f":"INDEX(sign_class[],MATCH(sign_type[[#This Row],[sign_class_code]],sign_class[sign_class_code],0),2)","v":"Permanent Warning"}]
[null,null,null,null,null,null,null,"PW24","Winding Road  NEXT \"__\" km","PW",{"$f":"INDEX(sign_class[],MATCH(sign_type[[#This Row],[sign_class_code]],sign_class[sign_class_code],0),2)","v":"Permanent Warning"}]
[null,null,null,null,null,null,null,"PW12","Y-Junction - Controlled","PW",{"$f":"INDEX(sign_class[],MATCH(sign_type[[#This Row],[sign_class_code]],sign_class[sign_class_code],0),2)","v":"Permanent Warning"}]
[null,null,null,null,null,null,null,"PW12.1","Y-Junction - Uncontrolled","PW",{"$f":"INDEX(sign_class[],MATCH(sign_type[[#This Row],[sign_class_code]],sign_class[sign_class_code],0),2)","v":"Permanent Warning"}]
[null,null,null,null,null,null,null,"RG6.1","__TRAFFIC (RG6 supplementary)","RG",{"$f":"INDEX(sign_class[],MATCH(sign_type[[#This Row],[sign_class_code]],sign_class[sign_class_code],0),2)","v":"Regulatory General"}]
[null,null,null,null,null,null,null,"RG26B","ALL Cycles Must Exit","RG",{"$f":"INDEX(sign_class[],MATCH(sign_type[[#This Row],[sign_class_code]],sign_class[sign_class_code],0),2)","v":"Regulatory General"}]
[null,null,null,null,null,null,null,"RG26","Cycle Route","RG",{"$f":"INDEX(sign_class[],MATCH(sign_type[[#This Row],[sign_class_code]],sign_class[sign_class_code],0),2)","v":"Regulatory General"}]
[null,null,null,null,null,null,null,"RG26.3","Cycle Route - \"__\"","RG",{"$f":"INDEX(sign_class[],MATCH(sign_type[[#This Row],[sign_class_code]],sign_class[sign_class_code],0),2)","v":"Regulatory General"}]
[null,null,null,null,null,null,null,"RG26.4","Cycle Route - Arrow","RG",{"$f":"INDEX(sign_class[],MATCH(sign_type[[#This Row],[sign_class_code]],sign_class[sign_class_code],0),2)","v":"Regulatory General"}]
[null,null,null,null,null,null,null,"RG26.1","Cycle Route - BEGINS","RG",{"$f":"INDEX(sign_class[],MATCH(sign_type[[#This Row],[sign_class_code]],sign_class[sign_class_code],0),2)","v":"Regulatory General"}]
[null,null,null,null,null,null,null,"RG26.2","Cycle Route - ENDS","RG",{"$f":"INDEX(sign_class[],MATCH(sign_type[[#This Row],[sign_class_code]],sign_class[sign_class_code],0),2)","v":"Regulatory General"}]
[null,null,null,null,null,null,null,"RG26A","Cycles ONLY","RG",{"$f":"INDEX(sign_class[],MATCH(sign_type[[#This Row],[sign_class_code]],sign_class[sign_class_code],0),2)","v":"Regulatory General"}]
[null,null,null,null,null,null,null,"RG2.1","Derestriction","RG",{"$f":"INDEX(sign_class[],MATCH(sign_type[[#This Row],[sign_class_code]],sign_class[sign_class_code],0),2)","v":"Regulatory General"}]
[null,null,null,null,null,null,null,"RG6","GIVE WAY","RG",{"$f":"INDEX(sign_class[],MATCH(sign_type[[#This Row],[sign_class_code]],sign_class[sign_class_code],0),2)","v":"Regulatory General"}]
[null,null,null,null,null,null,null,"RG17","Keep Left - Single Disc","RG",{"$f":"INDEX(sign_class[],MATCH(sign_type[[#This Row],[sign_class_code]],sign_class[sign_class_code],0),2)","v":"Regulatory General"}]
[null,null,null,null,null,null,null,"RG17.1","Keep Left - Twin Disc","RG",{"$f":"INDEX(sign_class[],MATCH(sign_type[[#This Row],[sign_class_code]],sign_class[sign_class_code],0),2)","v":"Regulatory General"}]
[null,null,null,null,null,null,null,"RG34","Keep Right - Single Disc","RG",{"$f":"INDEX(sign_class[],MATCH(sign_type[[#This Row],[sign_class_code]],sign_class[sign_class_code],0),2)","v":"Regulatory General"}]
[null,null,null,null,null,null,null,"RG3","Limited Speed Zone","RG",{"$f":"INDEX(sign_class[],MATCH(sign_type[[#This Row],[sign_class_code]],sign_class[sign_class_code],0),2)","v":"Regulatory General"}]
[null,null,null,null,null,null,null,"RG21","Low Clearance At Electrified Railway Crossing","RG",{"$f":"INDEX(sign_class[],MATCH(sign_type[[#This Row],[sign_class_code]],sign_class[sign_class_code],0),2)","v":"Regulatory General"}]
[null,null,null,null,null,null,null,"RG24","No Cycling","RG",{"$f":"INDEX(sign_class[],MATCH(sign_type[[#This Row],[sign_class_code]],sign_class[sign_class_code],0),2)","v":"Regulatory General"}]
[null,null,null,null,null,null,null,"RG9","NO ENTRY","RG",{"$f":"INDEX(sign_class[],MATCH(sign_type[[#This Row],[sign_class_code]],sign_class[sign_class_code],0),2)","v":"Regulatory General"}]
[null,null,null,null,null,null,null,"RG8","No Left Turn","RG",{"$f":"INDEX(sign_class[],MATCH(sign_type[[#This Row],[sign_class_code]],sign_class[sign_class_code],0),2)","v":"Regulatory General"}]
[null,null,null,null,null,null,null,"RG23","No Pedestrians","RG",{"$f":"INDEX(sign_class[],MATCH(sign_type[[#This Row],[sign_class_code]],sign_class[sign_class_code],0),2)","v":"Regulatory General"}]
[null,null,null,null,null,null,null,"RG7","No Right Turn","RG",{"$f":"INDEX(sign_class[],MATCH(sign_type[[#This Row],[sign_class_code]],sign_class[sign_class_code],0),2)","v":"Regulatory General"}]
[null,null,null,null,null,null,null,"RG10","No Turns","RG",{"$f":"INDEX(sign_class[],MATCH(sign_type[[#This Row],[sign_class_code]],sign_class[sign_class_code],0),2)","v":"Regulatory General"}]
[null,null,null,null,null,null,null,"RG15","No U Turn","RG",{"$f":"INDEX(sign_class[],MATCH(sign_type[[#This Row],[sign_class_code]],sign_class[sign_class_code],0),2)","v":"Regulatory General"}]
[null,null,null,null,null,null,null,"RG14","ONE WAY","RG",{"$f":"INDEX(sign_class[],MATCH(sign_type[[#This Row],[sign_class_code]],sign_class[sign_class_code],0),2)","v":"Regulatory General"}]
[null,null,null,null,null,null,null,"RG29","Overhead Lane Use Arrows","RG",{"$f":"INDEX(sign_class[],MATCH(sign_type[[#This Row],[sign_class_code]],sign_class[sign_class_code],0),2)","v":"Regulatory General"}]
[null,null,null,null,null,null,null,"RG25","Pedestrians","RG",{"$f":"INDEX(sign_class[],MATCH(sign_type[[#This Row],[sign_class_code]],sign_class[sign_class_code],0),2)","v":"Regulatory General"}]
[null,null,null,null,null,null,null,"RG33","Railway Level Crossing Flashing Light Signal","RG",{"$f":"INDEX(sign_class[],MATCH(sign_type[[#This Row],[sign_class_code]],sign_class[sign_class_code],0),2)","v":"Regulatory General"}]
[null,null,null,null,null,null,null,"RG31","Railway Level Crossing Give Way","RG",{"$f":"INDEX(sign_class[],MATCH(sign_type[[#This Row],[sign_class_code]],sign_class[sign_class_code],0),2)","v":"Regulatory General"}]
[null,null,null,null,null,null,null,"RG32","Railway Level Crossing Stop","RG",{"$f":"INDEX(sign_class[],MATCH(sign_type[[#This Row],[sign_class_code]],sign_class[sign_class_code],0),2)","v":"Regulatory General"}]
[null,null,null,null,null,null,null,"RG6.3","RIGHT TURNING TRAFFIC (RG6 supplementary)","RG",{"$f":"INDEX(sign_class[],MATCH(sign_type[[#This Row],[sign_class_code]],sign_class[sign_class_code],0),2)","v":"Regulatory General"}]
[null,null,null,null,null,null,null,"RG16","ROAD CLOSED","RG",{"$f":"INDEX(sign_class[],MATCH(sign_type[[#This Row],[sign_class_code]],sign_class[sign_class_code],0),2)","v":"Regulatory General"}]
[null,null,null,null,null,null,null,"RG19A","Road Narrows - Give Way (symbolic)","RG",{"$f":"INDEX(sign_class[],MATCH(sign_type[[#This Row],[sign_class_code]],sign_class[sign_class_code],0),2)","v":"Regulatory General"}]
[null,null,null,null,null,null,null,"RG20A","Road Narrows - Priority","RG",{"$f":"INDEX(sign_class[],MATCH(sign_type[[#This Row],[sign_class_code]],sign_class[sign_class_code],0),2)","v":"Regulatory General"}]
[null,null,null,null,null,null,null,"RG19.1A","Road Narrows - Supplementary GIVE WAY","RG",{"$f":"INDEX(sign_class[],MATCH(sign_type[[#This Row],[sign_class_code]],sign_class[sign_class_code],0),2)","v":"Regulatory General"}]
[null,null,null,null,null,null,null,"RG6R","Roundabout Give Way","RG",{"$f":"INDEX(sign_class[],MATCH(sign_type[[#This Row],[sign_class_code]],sign_class[sign_class_code],0),2)","v":"Regulatory General"}]
[null,null,null,null,null,null,null,"RG28","SCHOOL PATROL","RG",{"$f":"INDEX(sign_class[],MATCH(sign_type[[#This Row],[sign_class_code]],sign_class[sign_class_code],0),2)","v":"Regulatory General"}]
[null,null,null,null,null,null,null,"RS61-50","School Zone Ends (50)","RG",{"$f":"INDEX(sign_class[],MATCH(sign_type[[#This Row],[sign_class_code]],sign_class[sign_class_code],0),2)","v":"Regulatory General"}]
[null,null,null,null,null,null,null,"RS6","School Zone Fixed","RG",{"$f":"INDEX(sign_class[],MATCH(sign_type[[#This Row],[sign_class_code]],sign_class[sign_class_code],0),2)","v":"Regulatory General"}]
[null,null,null,null,null,null,null,"RS6V","School Zone Variable","RG",{"$f":"INDEX(sign_class[],MATCH(sign_type[[#This Row],[sign_class_code]],sign_class[sign_class_code],0),2)","v":"Regulatory General"}]
[null,null,null,null,null,null,null,"RG26C","Shared Path - Pedestrians & Cycles","RG",{"$f":"INDEX(sign_class[],MATCH(sign_type[[#This Row],[sign_class_code]],sign_class[sign_class_code],0),2)","v":"Regulatory General"}]
[null,null,null,null,null,null,null,"RG26D","Shared path - Pedestrians & Cycles (defined positions)","RG",{"$f":"INDEX(sign_class[],MATCH(sign_type[[#This Row],[sign_class_code]],sign_class[sign_class_code],0),2)","v":"Regulatory General"}]
[null,null,null,null,null,null,null,"RG20","Single Lane - Priority","RG",{"$f":"INDEX(sign_class[],MATCH(sign_type[[#This Row],[sign_class_code]],sign_class[sign_class_code],0),2)","v":"Regulatory General"}]
[null,null,null,null,null,null,null,"RG19","Single Lane Bridge - Give Way (symbolic)","RG",{"$f":"INDEX(sign_class[],MATCH(sign_type[[#This Row],[sign_class_code]],sign_class[sign_class_code],0),2)","v":"Regulatory General"}]
[null,null,null,null,null,null,null,"RG19.1","Single Lane Bridge - Supplementary GIVE WAY","RG",{"$f":"INDEX(sign_class[],MATCH(sign_type[[#This Row],[sign_class_code]],sign_class[sign_class_code],0),2)","v":"Regulatory General"}]
[null,null,null,null,null,null,null,"RG1","Speed Limit","RG",{"$f":"INDEX(sign_class[],MATCH(sign_type[[#This Row],[sign_class_code]],sign_class[sign_class_code],0),2)","v":"Regulatory General"}]
[null,null,null,null,null,null,null,"RG4","Speed Limit - TEMPORARY","RG",{"$f":"INDEX(sign_class[],MATCH(sign_type[[#This Row],[sign_class_code]],sign_class[sign_class_code],0),2)","v":"Regulatory General"}]
[null,null,null,null,null,null,null,"RG2","Speed Limit 100km/h","RG",{"$f":"INDEX(sign_class[],MATCH(sign_type[[#This Row],[sign_class_code]],sign_class[sign_class_code],0),2)","v":"Regulatory General"}]
[null,null,null,null,null,null,null,"RG1-20","Speed Limit 20km/h","RG",{"$f":"INDEX(sign_class[],MATCH(sign_type[[#This Row],[sign_class_code]],sign_class[sign_class_code],0),2)","v":"Regulatory General"}]
[null,null,null,null,null,null,null,"RG1-30","Speed Limit 30km/h","RG",{"$f":"INDEX(sign_class[],MATCH(sign_type[[#This Row],[sign_class_code]],sign_class[sign_class_code],0),2)","v":"Regulatory General"}]
[null,null,null,null,null,null,null,"RG1-50","Speed Limit 50km/h","RG",{"$f":"INDEX(sign_class[],MATCH(sign_type[[#This Row],[sign_class_code]],sign_class[sign_class_code],0),2)","v":"Regulatory General"}]
[null,null,null,null,null,null,null,"RG1-50P","Speed Limit 50km/h with PN-1","RG",{"$f":"INDEX(sign_class[],MATCH(sign_type[[#This Row],[sign_class_code]],sign_class[sign_class_code],0),2)","v":"Regulatory General"}]
[null,null,null,null,null,null,null,"RG1-60","Speed Limit 60km/h","RG",{"$f":"INDEX(sign_class[],MATCH(sign_type[[#This Row],[sign_class_code]],sign_class[sign_class_code],0),2)","v":"Regulatory General"}]
[null,null,null,null,null,null,null,"RG1-60P","Speed Limit 60km/h with PN-1","RG",{"$f":"INDEX(sign_class[],MATCH(sign_type[[#This Row],[sign_class_code]],sign_class[sign_class_code],0),2)","v":"Regulatory General"}]
[null,null,null,null,null,null,null,"RG1-70","Speed Limit 70km/h","RG",{"$f":"INDEX(sign_class[],MATCH(sign_type[[#This Row],[sign_class_code]],sign_class[sign_class_code],0),2)","v":"Regulatory General"}]
[null,null,null,null,null,null,null,"RG1-70P","Speed Limit 70km/h with PN-1","RG",{"$f":"INDEX(sign_class[],MATCH(sign_type[[#This Row],[sign_class_code]],sign_class[sign_class_code],0),2)","v":"Regulatory General"}]
[null,null,null,null,null,null,null,"RG1-80","Speed Limit 80km/h","RG",{"$f":"INDEX(sign_class[],MATCH(sign_type[[#This Row],[sign_class_code]],sign_class[sign_class_code],0),2)","v":"Regulatory General"}]
[null,null,null,null,null,null,null,"RG1-80P","Speed Limit 80km/h with PN-1","RG",{"$f":"INDEX(sign_class[],MATCH(sign_type[[#This Row],[sign_class_code]],sign_class[sign_class_code],0),2)","v":"Regulatory General"}]
[null,null,null,null,null,null,null,"RG1-90","Speed Limit 90km/h","RG",{"$f":"INDEX(sign_class[],MATCH(sign_type[[#This Row],[sign_class_code]],sign_class[sign_class_code],0),2)","v":"Regulatory General"}]
[null,null,null,null,null,null,null,"RS4-110","Speed Limit Standard 110 km/h","RG",{"$f":"INDEX(sign_class[],MATCH(sign_type[[#This Row],[sign_class_code]],sign_class[sign_class_code],0),2)","v":"Regulatory General"}]
[null,null,null,null,null,null,null,"RG5","STOP","RG",{"$f":"INDEX(sign_class[],MATCH(sign_type[[#This Row],[sign_class_code]],sign_class[sign_class_code],0),2)","v":"Regulatory General"}]
[null,null,null,null,null,null,null,"RG30","Stop On Red Signal","RG",{"$f":"INDEX(sign_class[],MATCH(sign_type[[#This Row],[sign_class_code]],sign_class[sign_class_code],0),2)","v":"Regulatory General"}]
[null,null,null,null,null,null,null,"RG6.2","STRAIGHT AHEAD TRAFFIC (RG6 supplementary)","RG",{"$f":"INDEX(sign_class[],MATCH(sign_type[[#This Row],[sign_class_code]],sign_class[sign_class_code],0),2)","v":"Regulatory General"}]
[null,null,null,null,null,null,null,"R7-1","Supplementary 'AHEAD'","RG",{"$f":"INDEX(sign_class[],MATCH(sign_type[[#This Row],[sign_class_code]],sign_class[sign_class_code],0),2)","v":"Regulatory General"}]
[null,null,null,null,null,null,null,"R7-2","Supplementary BEGINS","RG",{"$f":"INDEX(sign_class[],MATCH(sign_type[[#This Row],[sign_class_code]],sign_class[sign_class_code],0),2)","v":"Regulatory General"}]
[null,null,null,null,null,null,null,"R7-3","Supplementary ENDS","RG",{"$f":"INDEX(sign_class[],MATCH(sign_type[[#This Row],[sign_class_code]],sign_class[sign_class_code],0),2)","v":"Regulatory General"}]
[null,null,null,null,null,null,null,"R7-4","Supplementary Give Way","RG",{"$f":"INDEX(sign_class[],MATCH(sign_type[[#This Row],[sign_class_code]],sign_class[sign_class_code],0),2)","v":"Regulatory General"}]
[null,null,null,null,null,null,null,"RG4-20","Temporary Speed Limit 20km/h","RG",{"$f":"INDEX(sign_class[],MATCH(sign_type[[#This Row],[sign_class_code]],sign_class[sign_class_code],0),2)","v":"Regulatory General"}]
[null,null,null,null,null,null,null,"RG4-30","Temporary Speed Limit 30km/h","RG",{"$f":"INDEX(sign_class[],MATCH(sign_type[[#This Row],[sign_class_code]],sign_class[sign_class_code],0),2)","v":"Regulatory General"}]
[null,null,null,null,null,null,null,"RG4-50","Temporary Speed Limit 50km/h","RG",{"$f":"INDEX(sign_class[],MATCH(sign_type[[#This Row],[sign_class_code]],sign_class[sign_class_code],0),2)","v":"Regulatory General"}]
[null,null,null,null,null,null,null,"RG4-60","Temporary Speed Limit 60km/h","RG",{"$f":"INDEX(sign_class[],MATCH(sign_type[[#This Row],[sign_class_code]],sign_class[sign_class_code],0),2)","v":"Regulatory General"}]
[null,null,null,null,null,null,null,"RG4-70","Temporary Speed Limit 70km/h","RG",{"$f":"INDEX(sign_class[],MATCH(sign_type[[#This Row],[sign_class_code]],sign_class[sign_class_code],0),2)","v":"Regulatory General"}]
[null,null,null,null,null,null,null,"RG11","Turn","RG",{"$f":"INDEX(sign_class[],MATCH(sign_type[[#This Row],[sign_class_code]],sign_class[sign_class_code],0),2)","v":"Regulatory General"}]
[null,null,null,null,null,null,null,"RG12","Turn Left","RG",{"$f":"INDEX(sign_class[],MATCH(sign_type[[#This Row],[sign_class_code]],sign_class[sign_class_code],0),2)","v":"Regulatory General"}]
[null,null,null,null,null,null,null,"RG13","Turn Right","RG",{"$f":"INDEX(sign_class[],MATCH(sign_type[[#This Row],[sign_class_code]],sign_class[sign_class_code],0),2)","v":"Regulatory General"}]
[null,null,null,null,null,null,null,"RG27","TURNING TRAFFIC GIVE WAY TO PEDESTRIANS","RG",{"$f":"INDEX(sign_class[],MATCH(sign_type[[#This Row],[sign_class_code]],sign_class[sign_class_code],0),2)","v":"Regulatory General"}]
[null,null,null,null,null,null,null,"RG22","USE LEFT LANE UNLESS PASSING","RG",{"$f":"INDEX(sign_class[],MATCH(sign_type[[#This Row],[sign_class_code]],sign_class[sign_class_code],0),2)","v":"Regulatory General"}]
[null,null,null,null,null,null,null,"RG18","WRONG WAY","RG",{"$f":"INDEX(sign_class[],MATCH(sign_type[[#This Row],[sign_class_code]],sign_class[sign_class_code],0),2)","v":"Regulatory General"}]
[null,null,null,null,null,null,null,"RH7","HEAVY TRAFFIC BY PASS","RH",{"$f":"INDEX(sign_class[],MATCH(sign_type[[#This Row],[sign_class_code]],sign_class[sign_class_code],0),2)","v":"Regulatory Heavy Vehicle"}]
[null,null,null,null,null,null,null,"RH6","HEAVY VEHICLE - AXLE LIMIT","RH",{"$f":"INDEX(sign_class[],MATCH(sign_type[[#This Row],[sign_class_code]],sign_class[sign_class_code],0),2)","v":"Regulatory Heavy Vehicle"}]
[null,null,null,null,null,null,null,"RH4","HEAVY VEHICLE - BRIDGE LIMITS","RH",{"$f":"INDEX(sign_class[],MATCH(sign_type[[#This Row],[sign_class_code]],sign_class[sign_class_code],0),2)","v":"Regulatory Heavy Vehicle"}]
[null,null,null,null,null,null,null,"RH5","Heavy Vehicle - RH4 Supplementary - \" _ \"m","RH",{"$f":"INDEX(sign_class[],MATCH(sign_type[[#This Row],[sign_class_code]],sign_class[sign_class_code],0),2)","v":"Regulatory Heavy Vehicle"}]
[null,null,null,null,null,null,null,"RH2","HEAVY VEHICLES - MAX LENGTH","RH",{"$f":"INDEX(sign_class[],MATCH(sign_type[[#This Row],[sign_class_code]],sign_class[sign_class_code],0),2)","v":"Regulatory Heavy Vehicle"}]
[null,null,null,null,null,null,null,"RH1","Road Classification - Heavy Vehicles","RH",{"$f":"INDEX(sign_class[],MATCH(sign_type[[#This Row],[sign_class_code]],sign_class[sign_class_code],0),2)","v":"Regulatory Heavy Vehicle"}]
[null,null,null,null,null,null,null,"RP3.2","BEGINS (RP3 RP3.1 Supplementary)","RP",{"$f":"INDEX(sign_class[],MATCH(sign_type[[#This Row],[sign_class_code]],sign_class[sign_class_code],0),2)","v":"Regulatory Parking"}]
[null,null,null,null,null,null,null,"RP5","BUS STOP","RP",{"$f":"INDEX(sign_class[],MATCH(sign_type[[#This Row],[sign_class_code]],sign_class[sign_class_code],0),2)","v":"Regulatory Parking"}]
[null,null,null,null,null,null,null,"RP5.1","BUS STOP - With Arrow","RP",{"$f":"INDEX(sign_class[],MATCH(sign_type[[#This Row],[sign_class_code]],sign_class[sign_class_code],0),2)","v":"Regulatory Parking"}]
[null,null,null,null,null,null,null,"RP3","CLEARWAY - Single Peak Period","RP",{"$f":"INDEX(sign_class[],MATCH(sign_type[[#This Row],[sign_class_code]],sign_class[sign_class_code],0),2)","v":"Regulatory Parking"}]
[null,null,null,null,null,null,null,"RP3.1","CLEARWAY - Two Peak Period","RP",{"$f":"INDEX(sign_class[],MATCH(sign_type[[#This Row],[sign_class_code]],sign_class[sign_class_code],0),2)","v":"Regulatory Parking"}]
[null,null,null,null,null,null,null,"RP3.5","CLEARWAY With Parking Restriction","RP",{"$f":"INDEX(sign_class[],MATCH(sign_type[[#This Row],[sign_class_code]],sign_class[sign_class_code],0),2)","v":"Regulatory Parking"}]
[null,null,null,null,null,null,null,"RP9","Cycle Stand","RP",{"$f":"INDEX(sign_class[],MATCH(sign_type[[#This Row],[sign_class_code]],sign_class[sign_class_code],0),2)","v":"Regulatory Parking"}]
[null,null,null,null,null,null,null,"RP9.1","Cycle Stand - With Arrow","RP",{"$f":"INDEX(sign_class[],MATCH(sign_type[[#This Row],[sign_class_code]],sign_class[sign_class_code],0),2)","v":"Regulatory Parking"}]
[null,null,null,null,null,null,null,"RP10","Disabled Parking","RP",{"$f":"INDEX(sign_class[],MATCH(sign_type[[#This Row],[sign_class_code]],sign_class[sign_class_code],0),2)","v":"Regulatory Parking"}]
[null,null,null,null,null,null,null,"RP3.3","ENDS (RP3 RP3.1 Supplementary)","RP",{"$f":"INDEX(sign_class[],MATCH(sign_type[[#This Row],[sign_class_code]],sign_class[sign_class_code],0),2)","v":"Regulatory Parking"}]
[null,null,null,null,null,null,null,"RP2.1","Late Night Extension - (RP2 Supplementary)","RP",{"$f":"INDEX(sign_class[],MATCH(sign_type[[#This Row],[sign_class_code]],sign_class[sign_class_code],0),2)","v":"Regulatory Parking"}]
[null,null,null,null,null,null,null,"RP7","LOADING ZONE","RP",{"$f":"INDEX(sign_class[],MATCH(sign_type[[#This Row],[sign_class_code]],sign_class[sign_class_code],0),2)","v":"Regulatory Parking"}]
[null,null,null,null,null,null,null,"RP7.2","Loading Zone - GOODS VEHICLES ONLY (Supplementary)","RP",{"$f":"INDEX(sign_class[],MATCH(sign_type[[#This Row],[sign_class_code]],sign_class[sign_class_code],0),2)","v":"Regulatory Parking"}]
[null,null,null,null,null,null,null,"RP7.1","LOADING ZONE - With Arrow","RP",{"$f":"INDEX(sign_class[],MATCH(sign_type[[#This Row],[sign_class_code]],sign_class[sign_class_code],0),2)","v":"Regulatory Parking"}]
[null,null,null,null,null,null,null,"RP3.4","MON-FRI (Clearway Supplementary)","RP",{"$f":"INDEX(sign_class[],MATCH(sign_type[[#This Row],[sign_class_code]],sign_class[sign_class_code],0),2)","v":"Regulatory Parking"}]
[null,null,null,null,null,null,null,"RP8","Motorcycle Parking","RP",{"$f":"INDEX(sign_class[],MATCH(sign_type[[#This Row],[sign_class_code]],sign_class[sign_class_code],0),2)","v":"Regulatory Parking"}]
[null,null,null,null,null,null,null,"RP8.1","Motorcycle Parking - With Arrow","RP",{"$f":"INDEX(sign_class[],MATCH(sign_type[[#This Row],[sign_class_code]],sign_class[sign_class_code],0),2)","v":"Regulatory Parking"}]
[null,null,null,null,null,null,null,"RP1","No Stopping","RP",{"$f":"INDEX(sign_class[],MATCH(sign_type[[#This Row],[sign_class_code]],sign_class[sign_class_code],0),2)","v":"Regulatory Parking"}]
[null,null,null,null,null,null,null,"RP1.3","No Stopping - ENDS (RP1 Supplementary)","RP",{"$f":"INDEX(sign_class[],MATCH(sign_type[[#This Row],[sign_class_code]],sign_class[sign_class_code],0),2)","v":"Regulatory Parking"}]
[null,null,null,null,null,null,null,"RP2","No Stopping - Specified Period","RP",{"$f":"INDEX(sign_class[],MATCH(sign_type[[#This Row],[sign_class_code]],sign_class[sign_class_code],0),2)","v":"Regulatory Parking"}]
[null,null,null,null,null,null,null,"RP1.1","No Stopping At All Times","RP",{"$f":"INDEX(sign_class[],MATCH(sign_type[[#This Row],[sign_class_code]],sign_class[sign_class_code],0),2)","v":"Regulatory Parking"}]
[null,null,null,null,null,null,null,"RP1.2","No Stopping FOR \"__\" km","RP",{"$f":"INDEX(sign_class[],MATCH(sign_type[[#This Row],[sign_class_code]],sign_class[sign_class_code],0),2)","v":"Regulatory Parking"}]
[null,null,null,null,null,null,null,"RP12","Repeater Zone Parking","RP",{"$f":"INDEX(sign_class[],MATCH(sign_type[[#This Row],[sign_class_code]],sign_class[sign_class_code],0),2)","v":"Regulatory Parking"}]
[null,null,null,null,null,null,null,"RP4.3","Restricted Parking - Late Night Extension","RP",{"$f":"INDEX(sign_class[],MATCH(sign_type[[#This Row],[sign_class_code]],sign_class[sign_class_code],0),2)","v":"Regulatory Parking"}]
[null,null,null,null,null,null,null,"RP4.1","Restricted Parking - Non Standard Hours","RP",{"$f":"INDEX(sign_class[],MATCH(sign_type[[#This Row],[sign_class_code]],sign_class[sign_class_code],0),2)","v":"Regulatory Parking"}]
[null,null,null,null,null,null,null,"RP4.2","Restricted Parking - Other Times","RP",{"$f":"INDEX(sign_class[],MATCH(sign_type[[#This Row],[sign_class_code]],sign_class[sign_class_code],0),2)","v":"Regulatory Parking"}]
[null,null,null,null,null,null,null,"RP4","Restricted Parking - Standard Hours","RP",{"$f":"INDEX(sign_class[],MATCH(sign_type[[#This Row],[sign_class_code]],sign_class[sign_class_code],0),2)","v":"Regulatory Parking"}]
[null,null,null,null,null,null,null,"NS1","STAFF 8am - 4pm School Days","RP",{"$f":"INDEX(sign_class[],MATCH(sign_type[[#This Row],[sign_class_code]],sign_class[sign_class_code],0),2)","v":"Regulatory Parking"}]
[null,null,null,null,null,null,null,"RP6","TAXI STAND","RP",{"$f":"INDEX(sign_class[],MATCH(sign_type[[#This Row],[sign_class_code]],sign_class[sign_class_code],0),2)","v":"Regulatory Parking"}]
[null,null,null,null,null,null,null,"RP6.1","TAXI STAND - With Arrow","RP",{"$f":"INDEX(sign_class[],MATCH(sign_type[[#This Row],[sign_class_code]],sign_class[sign_class_code],0),2)","v":"Regulatory Parking"}]
[null,null,null,null,null,null,null,"RP11","Zone Parking Notification","RP",{"$f":"INDEX(sign_class[],MATCH(sign_type[[#This Row],[sign_class_code]],sign_class[sign_class_code],0),2)","v":"Regulatory Parking"}]
[null,null,null,null,null,null,null,"TS1","Feature \"__\"m ON left/right","T",{"$f":"INDEX(sign_class[],MATCH(sign_type[[#This Row],[sign_class_code]],sign_class[sign_class_code],0),2)","v":"Tourist"}]
[null,null,null,null,null,null,null,"TS4","Feature name with arrow","T",{"$f":"INDEX(sign_class[],MATCH(sign_type[[#This Row],[sign_class_code]],sign_class[sign_class_code],0),2)","v":"Tourist"}]
[null,null,null,null,null,null,null,"TS2","Feature TURN left/right \"__\"m","T",{"$f":"INDEX(sign_class[],MATCH(sign_type[[#This Row],[sign_class_code]],sign_class[sign_class_code],0),2)","v":"Tourist"}]
[null,null,null,null,null,null,null,"TS5","Major tourist attractions - special information","T",{"$f":"INDEX(sign_class[],MATCH(sign_type[[#This Row],[sign_class_code]],sign_class[sign_class_code],0),2)","v":"Tourist"}]
[null,null,null,null,null,null,null,"TS3A","Position sign - One line description with chevron","T",{"$f":"INDEX(sign_class[],MATCH(sign_type[[#This Row],[sign_class_code]],sign_class[sign_class_code],0),2)","v":"Tourist"}]
[null,null,null,null,null,null,null,"TS3B","Position sign - Two line description with chevron","T",{"$f":"INDEX(sign_class[],MATCH(sign_type[[#This Row],[sign_class_code]],sign_class[sign_class_code],0),2)","v":"Tourist"}]
[null,null,null,null,null,null,null,"TRM","Touring Route Marker - Symbolic","T",{"$f":"INDEX(sign_class[],MATCH(sign_type[[#This Row],[sign_class_code]],sign_class[sign_class_code],0),2)","v":"Tourist"}]
[null,null,null,null,null,null,null,"TR6","TOURIST DRIVE \"__\"km FOLLOW route marker","T",{"$f":"INDEX(sign_class[],MATCH(sign_type[[#This Row],[sign_class_code]],sign_class[sign_class_code],0),2)","v":"Tourist"}]
[null,null,null,null,null,null,null,"TR4","TOURIST DRIVE TURN side \"__\"m","T",{"$f":"INDEX(sign_class[],MATCH(sign_type[[#This Row],[sign_class_code]],sign_class[sign_class_code],0),2)","v":"Tourist"}]
[null,null,null,null,null,null,null,"TR5","TOURIST DRIVE with Route marker and Chevron","T",{"$f":"INDEX(sign_class[],MATCH(sign_type[[#This Row],[sign_class_code]],sign_class[sign_class_code],0),2)","v":"Tourist"}]
[null,null,null,null,null,null,null,"THT","Tourist Heritage Trail","T",{"$f":"INDEX(sign_class[],MATCH(sign_type[[#This Row],[sign_class_code]],sign_class[sign_class_code],0),2)","v":"Tourist"}]
[null,null,null,null,null,null,null,"TR2","Tourist route marker - arrow and route number","T",{"$f":"INDEX(sign_class[],MATCH(sign_type[[#This Row],[sign_class_code]],sign_class[sign_class_code],0),2)","v":"Tourist"}]
[null,null,null,null,null,null,null,"TR1","Tourist route marker - arrow only","T",{"$f":"INDEX(sign_class[],MATCH(sign_type[[#This Row],[sign_class_code]],sign_class[sign_class_code],0),2)","v":"Tourist"}]
[null,null,null,null,null,null,null,"TR3","Tourist route marker - END and route number","T",{"$f":"INDEX(sign_class[],MATCH(sign_type[[#This Row],[sign_class_code]],sign_class[sign_class_code],0),2)","v":"Tourist"}]
[null,null,null,null,null,null,null,"TSW","Welcome To ........","T",{"$f":"INDEX(sign_class[],MATCH(sign_type[[#This Row],[sign_class_code]],sign_class[sign_class_code],0),2)","v":"Tourist"}]
[null,null,null,null,null,null,null,"TW6","Cattle","TW",{"$f":"INDEX(sign_class[],MATCH(sign_type[[#This Row],[sign_class_code]],sign_class[sign_class_code],0),2)","v":"Temporary Warning"}]
[null,null,null,null,null,null,null,"TW2.1","Other Hazard - Flooding","TW",{"$f":"INDEX(sign_class[],MATCH(sign_type[[#This Row],[sign_class_code]],sign_class[sign_class_code],0),2)","v":"Temporary Warning"}]
[null,null,null,null,null,null,null,"TW20","Road closed","TW",{"$f":"INDEX(sign_class[],MATCH(sign_type[[#This Row],[sign_class_code]],sign_class[sign_class_code],0),2)","v":"Temporary Warning"}]
[null,null,null,null,null,null,null,"TW4.1","Slippery Surface - Ice/Grit","TW",{"$f":"INDEX(sign_class[],MATCH(sign_type[[#This Row],[sign_class_code]],sign_class[sign_class_code],0),2)","v":"Temporary Warning"}]
[null,null,null,null,null,null,null,"WM02","AGED PERSONS","WM",{"$f":"INDEX(sign_class[],MATCH(sign_type[[#This Row],[sign_class_code]],sign_class[sign_class_code],0),2)","v":"Warning Miscellaneous"}]
[null,null,null,null,null,null,null,"WM10","BRIDGE LANES OPEN","WM",{"$f":"INDEX(sign_class[],MATCH(sign_type[[#This Row],[sign_class_code]],sign_class[sign_class_code],0),2)","v":"Warning Miscellaneous"}]
[null,null,null,null,null,null,null,"TW23","DETOUR ENDS","WM",{"$f":"INDEX(sign_class[],MATCH(sign_type[[#This Row],[sign_class_code]],sign_class[sign_class_code],0),2)","v":"Warning Miscellaneous"}]
[null,null,null,null,null,null,null,"WM15","ELECTRONIC WARNING - ICE","WM",{"$f":"INDEX(sign_class[],MATCH(sign_type[[#This Row],[sign_class_code]],sign_class[sign_class_code],0),2)","v":"Warning Miscellaneous"}]
[null,null,null,null,null,null,null,"WM16","ELECTRONIC WARNING - VARIABLE","WM",{"$f":"INDEX(sign_class[],MATCH(sign_type[[#This Row],[sign_class_code]],sign_class[sign_class_code],0),2)","v":"Warning Miscellaneous"}]
[null,null,null,null,null,null,null,"WM14","LANE CONTROL SIGNALS AHEAD","WM",{"$f":"INDEX(sign_class[],MATCH(sign_type[[#This Row],[sign_class_code]],sign_class[sign_class_code],0),2)","v":"Warning Miscellaneous"}]
[null,null,null,null,null,null,null,"WM09","LEFT LANE EMERGENCY VEHCILES ONLY","WM",{"$f":"INDEX(sign_class[],MATCH(sign_type[[#This Row],[sign_class_code]],sign_class[sign_class_code],0),2)","v":"Warning Miscellaneous"}]
[null,null,null,null,null,null,null,"WM08","NO TRUCKS","WM",{"$f":"INDEX(sign_class[],MATCH(sign_type[[#This Row],[sign_class_code]],sign_class[sign_class_code],0),2)","v":"Warning Miscellaneous"}]
[null,null,null,null,null,null,null,"WM01","RESIDENTIAL AREA","WM",{"$f":"INDEX(sign_class[],MATCH(sign_type[[#This Row],[sign_class_code]],sign_class[sign_class_code],0),2)","v":"Warning Miscellaneous"}]
[null,null,null,null,null,null,null,"WM12","SIGNALS AHEAD","WM",{"$f":"INDEX(sign_class[],MATCH(sign_type[[#This Row],[sign_class_code]],sign_class[sign_class_code],0),2)","v":"Warning Miscellaneous"}]
[null,null,null,null,null,null,null,"WM13","SLOW - LANE CONTROL","WM",{"$f":"INDEX(sign_class[],MATCH(sign_type[[#This Row],[sign_class_code]],sign_class[sign_class_code],0),2)","v":"Warning Miscellaneous"}]
[null,null,null,null,null,null,null,"WM05","SPEED CAMERA AREA","WM",{"$f":"INDEX(sign_class[],MATCH(sign_type[[#This Row],[sign_class_code]],sign_class[sign_class_code],0),2)","v":"Warning Miscellaneous"}]
[null,null,null,null,null,null,null,"TW21","STATE HIGHWAY DETOUR Follow","WM",{"$f":"INDEX(sign_class[],MATCH(sign_type[[#This Row],[sign_class_code]],sign_class[sign_class_code],0),2)","v":"Warning Miscellaneous"}]
[null,null,null,null,null,null,null,"TW22L45","STATE HIGHWAY DETOUR Left 45deg Arrow","WM",{"$f":"INDEX(sign_class[],MATCH(sign_type[[#This Row],[sign_class_code]],sign_class[sign_class_code],0),2)","v":"Warning Miscellaneous"}]
[null,null,null,null,null,null,null,"TW22L","STATE HIGHWAY DETOUR Left Arrow","WM",{"$f":"INDEX(sign_class[],MATCH(sign_type[[#This Row],[sign_class_code]],sign_class[sign_class_code],0),2)","v":"Warning Miscellaneous"}]
[null,null,null,null,null,null,null,"TW22R45","STATE HIGHWAY DETOUR Right 45deg Arrow","WM",{"$f":"INDEX(sign_class[],MATCH(sign_type[[#This Row],[sign_class_code]],sign_class[sign_class_code],0),2)","v":"Warning Miscellaneous"}]
[null,null,null,null,null,null,null,"TW22R","STATE HIGHWAY DETOUR Right Arrow","WM",{"$f":"INDEX(sign_class[],MATCH(sign_type[[#This Row],[sign_class_code]],sign_class[sign_class_code],0),2)","v":"Warning Miscellaneous"}]
[null,null,null,null,null,null,null,"TW22S","STATE HIGHWAY DETOUR Straight Ahead Arrow","WM",{"$f":"INDEX(sign_class[],MATCH(sign_type[[#This Row],[sign_class_code]],sign_class[sign_class_code],0),2)","v":"Warning Miscellaneous"}]
[null,null,null,null,null,null,null,"WM07","TRUCKS STOP - Weighstation","WM",{"$f":"INDEX(sign_class[],MATCH(sign_type[[#This Row],[sign_class_code]],sign_class[sign_class_code],0),2)","v":"Warning Miscellaneous"}]
[null,null,null,null,null,null,null,"WM11","USING LANES WITH X PROHIBITED","WM",{"$f":"INDEX(sign_class[],MATCH(sign_type[[#This Row],[sign_class_code]],sign_class[sign_class_code],0),2)","v":"Warning Miscellaneous"}]
[null,null,null,null,null,null,null,"WM03","Warning (Miscellaneous Sign) - User defined","WM",{"$f":"INDEX(sign_class[],MATCH(sign_type[[#This Row],[sign_class_code]],sign_class[sign_class_code],0),2)","v":"Warning Miscellaneous"}]
[null,null,null,null,null,null,null,"WM04","Warning (Miscellaneous Sign) - User defined","WM",{"$f":"INDEX(sign_class[],MATCH(sign_type[[#This Row],[sign_class_code]],sign_class[sign_class_code],0),2)","v":"Warning Miscellaneous"}]
[null,null,null,null,null,null,null,"WM06","WEIGH STATION AHEAD","WM",{"$f":"INDEX(sign_class[],MATCH(sign_type[[#This Row],[sign_class_code]],sign_class[sign_class_code],0),2)","v":"Warning Miscellaneous"}]
[null,null,null,null,null,null,null,"WMW02","EXIT (Advisory Speed)","WMW",{"$f":"INDEX(sign_class[],MATCH(sign_type[[#This Row],[sign_class_code]],sign_class[sign_class_code],0),2)","v":"Warning Motorway"}]
[null,null,null,null,null,null,null,"WMW03","LANE ENDS 200 metres","WMW",{"$f":"INDEX(sign_class[],MATCH(sign_type[[#This Row],[sign_class_code]],sign_class[sign_class_code],0),2)","v":"Warning Motorway"}]

{"sheet":"LU Surfacing","index":37,"n_rows":71,"n_cols":20,"rows_kept":71,"cut":false,"hidden":false,"merged":[]}
["Contents"]
[null,"surf_material_code","surf_material","surf_material_type",null,"surf_function_code","surf_function",null,"surf_adhesion_code","surf_adhesion",null,"polymer_type_code","polymer_type",null,"surf_spec_code","surf_spec",null,"work_category_id","work_origin_id","activity_class_id"]
[null,"1CHIP","Single Coat Seal",2,null,1,"1st Coat",null,"AG75","Aggbind Exp 75",null,"160A","Flexiphalt 160A",null,"M10","Specification for dense graded and stone mastic asphalts.",null,36,"AC Inlay",6]
[null,"2CHIP","Two Coat Seal",2,null,2,"2nd Coat",null,"AGAF","Aggbind AF",null,"330A","Flexiphalt 330A",null,"P11","Specification for Open Graded Porous Asphalt",null,3,"Activity management planning improvement",1]
[null,"3CHIP","Three Coat Seal",2,null,"M","Membrane Seal",null,"AS18","Bitubind AS18",null,"340A","Flexiphalt 340A",null,"P11E","Specification for Epoxy Modified Open Graded Porous Asphalt",null,49,"Advance property purchase - local roads",8]
[null,"AC","Asphaltic Concrete",5,null,"R","Reseal",null,"BP50","BP50C",null,"350A","Flexiphalt 350A",null,"P17","Performance Based Specification for Reseals",null,40,"Associated Improvements",6]
[null,"ACM","Dense graded asphalt AC (M/10)",5,null,null,null,null,"BTRN","Bitran H",null,"351A","Flexiphalt 351A",null,"P23","Performance Based Specification for Hotmix Asphalt Wearing Course Surfacing",null,21,"Base Preservation Drainage Length",6]
[null,"B/S","Sandwich Seal",2,null,null,null,null,"C101","Chemcolour 101",null,"AX14","Mobilflex",null,"P25","Pilot Specification for Calcined Bauxite",null,36,"Basecourse Overlay",6]
[null,"BBM","Bitumen Bound Macadam",5,null,"surf_binder_code","surf_binder",null,"CC59","Synthecol CC59LT",null,"AXH","PAVEflex SBS High Modified Asphalt Binder",null,"P3","Specification for First Coat Sealing - Method Based",null,10,"Bus services",4]
[null,"BOLID","BOLIDT Polyurethane Mix",4,null,"B130","Bitumen 130/150",null,"CECA","CECA EXP 3747",null,"AXM","PAVEflex SBS Medium Modified Asphalt Binder",null,"P4","Specification for Resealing - Method Based",null,19,"Customer LoS roughness maintenance",6]
[null,"CAPE","Capeseal",1,null,"B180","Bitumen 180/200",null,"CERT","CECABASE RT BIO 10",null,"E373","Emulsiphalt 373",null,"P9","Construction of Asphaltic Concrete Paving",null,19,"Customer LoS rutting maintenance",6]
[null,"COMB","Combination Seal",2,null,"B45","Bitumen 45/55",null,"D184","Dinaram 184",null,"E374","Emulsiphalt 374",null,"PCON","Contract specific Specification for Hotmix Asphalt Wearing Course Surfacing",null,26,"Cycle path maintenance",6]
[null,"CONC","Concrete",5,null,"B60","Bitumen 60/70",null,"D374","Dinaram 3747",null,"E375","Emulsiphalt 375",null,null,null,null,9,"Cycling facilities",3]
[null,"DGM","Dense graded asphalt DG (M/10)",5,null,"B80","Bitumen 80/100",null,"DHBG","Diamin HBG",null,"EFXC","Emoflex C",null,null,null,null,35,"Drainage renewals",6]
[null,"ENRAC","Enrichment seal over Asphalt",4,null,"E130","Emulsion 130/150",null,"DMP2","Dope MP-2",null,"ERL","PAVEflex SBR Low Modified 180/200 Emulsion",null,"surf_recycled_cpnt_code","surf_recycled_cpnt",null,50,"Efficiency",8]
[null,"ENRCS","Enrichment seal over chipseal",4,null,"E180","Emulsion 180/200",null,"DMPL","Duomeen T(Pastille)",null,"ERM","PAVEflex SBR Medium Modified 180/200 Emulsion",null,"CRBR","Crumb Rubber",null,29,"Emergency works",6]
[null,"EPA","Epoxy Porous Asphalt (EMOGPA)",5,null,"E80","Emulsion 80/100",null,"DMPS","Duomeen T(Paste)",null,"EXH","PAVEflex SBS High Modified 180/200 Emulsion",null,"GLAS","Glass",null,23,"Environmental maintenance",6]
[null,"EPAHS","EpoxyPorousAsphalt High Stren",5,null,"EPOX","Epoxy Resin",null,"DOLB","Diamin OLB",null,"EXL","PAVEflex SBS Low Modified 180/200 Emulsion",null,"MA","Marginal Aggregate",null,38,"Environmental Renewals",6]
[null,"EPAHV","Epoxy PorousAsphalt HIGH VOIDS",5,null,"MGB","Multi Grade Binder",null,"F102","Fentamine BE102",null,"EXM","PAVEflex SBS Medium Modified 180/200 Emulsion",null,"RAP","Reclaimed Asphaltic Pavement",null,32,"Financial grants",6]
[null,"FRIC","Friction Seal",2,null,"POLY","Polyurethane",null,"INTF","Interfacial adhesion",null,"HIFX","Flexiphalt HiFlex",null,"SLAG","Slag",null,36,"Foam Bitumen Stabilisation",6]
[null,"INBLK","Interlocking concrete blocks",5,null,"PORT","Portland Cement",null,"MGA1","Megamine 100",null,"HIMD","Flexiphalt HiMod",null,null,null,null,36,"Full Replacement",6]
[null,"LOCK","Locking Coat Seal",2,null,null,null,null,"MGBA","Megamine BA",null,"PMBP","PAVEflex PMB",null,null,null,null,36,"Granular Replacement",6]
[null,"METAL","Metal running course",5,null,null,null,null,"N422","Redicote N422",null,"RLA","RLA2066/S",null,"surf_reason_code","surf_reason",null,19,"Heavy Duty Maintenance - NPV option",6]
[null,"OGPA","Open Graded Porous Asphalt",5,null,"cutter_type_code","cutter_type",null,"N561","Redicote N561",null,"RSDS","Road Science RS 2 Dust Seal",null,"CR","Cracking",null,27,"Level crossing warning devices",6]
[null,"OGPAH","HighStrength Open Graded Porou",5,null,"KERO","Kerosene",null,"N606","Redicote N606",null,"RSHD","Road Science RS 4 Heavy Duty",null,"FC","First Coat (on new pavement , AWT or rehab)",null,6,"Management of the funding allocation system",1]
[null,"OGPAV","High Voids Open Graded Porous",5,null,"TURP","Turpentine",null,"N893","Redicote N893",null,"RSHE","Road Science RS 4 Heavy Duty Extreme",null,"FL","Flushing (all loss of macrotexture)",null,28,"Minor events",6]
[null,"PSEAL","Prime Coat",4,null,"OTHR","Other",null,"P200","Polyram L200",null,"RSHG","Road Science RS 3 High Strength",null,"HS","Holding Seal",null,30,"Network and asset management",6]
[null,"PSKID","Premium skid surface PSV >70",5,null,null,null,null,"P374","Polyram 3747",null,"RSHP","Road Science RS 4 Heavy Duty Plus",null,"PS","Polished Stone (from SCRIM)",null,44,"New roads",8]
[null,"RACK","Racked in Seal",2,null,null,null,null,"RDIZ","Redicote Z",null,"RSL1","Road Science RS 1 Improved Seal",null,"RA","Ravelling (AC surfaces)",null,42,"New traffic management facilities",8]
[null,"RCHIP","Red Chip Seal (McCullum)",2,null,"surf_additive_code","surf_additive",null,"RIVR","Rivertex",null,"RSL2","Road Science RS 1 Improved Seal Plus",null,"RU","Rutting (wheelpath treatment only)",null,34,"Non-Base Preservation",6]
[null,"SLRY","Slurry Seal",1,null,"CF","Cellulose Fibre",null,"S520","Synthecol 520",null,"RSL3","Road Science RS 1 Improved Seal Extreme",null,"SC","Scabbing",null,25,"Operational traffic management",6]
[null,"SMA","Stone Mastic Asphalt",5,null,"CRBR","Crumb Rubber",null,"SCOL","Synthecol CC 519 A",null,"RSPA","Road Science RS 3 Porous Asphalt",null,"SE","Second Coat",null,11,"Passenger ferry services",4]
[null,"TEXT","Texturising Seal",3,null,"LIME","Lime",null,"SHTA","Shell Tenicon A",null,"RSQR","Road Science RS 3 Quiet Road",null,"SS","Special Surfacings (reason req'd)",null,13,"Passenger rail services",4]
[null,"UTA","Ultra Thin Asphalt",5,null,"NRLX","Natural Rubber Latex",null,"TAA3","Tomah 3000",null,"RSS1","Road Science RS 1 Superior Seal",null,null,null,null,34,"Pavement Preservation",6]
[null,"VFILL","Void fill seal",2,null,"PLST","Plastic - PVC or PET",null,"WTBE","Wetfix BE",null,"RSS2","Road Science RS 1 Superior Seal Plus",null,null,null,null,41,"Preventive Maintenance",6]
[null,null,null,null,null,null,null,null,"WTFX","Wetfix C",null,"RSS3","Road Science RS 1 Superior Seal Extreme",null,null,null,null,19,"Principal's Risk Non-routine maintenance",6]
[null,null,null,null,null,null,null,null,null,null,null,"RSSP","Road Science RS 4 Spill Resistant",null,null,null,null,4,"Programme business case development",1]
[null,"Type","Code","use_calc_depth",null,null,null,null,null,null,null,"RSUT","Road Science RS 3 Ultra Thin",null,null,null,null,7,"Promotion, education and advertising",2]
[null,"Capeseal",1,"N",null,null,null,null,null,null,null,"SBR","Styrene Butadiene Rubber",null,null,null,null,31,"Property management (state highways),",6]
[null,"Chipseal",2,"Y",null,null,null,null,null,null,null,"SBS","Styrene Butadiene Styrene",null,null,null,null,48,"Property purchase - local roads",8]
[null,"Chipseal OR Membrane",3,"Y",null,null,null,null,null,null,null,"SIS","Styrene Isoprene Styrene",null,null,null,null,47,"Property purchase - state highways",8]
[null,"Membrane",4,"N",null,null,null,null,null,null,null,"SXH","PAVEflex SBS High Modified 180/200 Cutback",null,null,null,null,12,"Public transport facilities operations and maintenance",4]
[null,"Other ",5,"N",null,null,null,null,null,null,null,"SXL","PAVEflex SBS Low Modified 180/200 Cutback",null,null,null,null,18,"Public transport improvements, major renewals and minor improvements",4]
[null,null,null,null,null,null,null,null,null,null,null,"SXM","PAVEflex SBS Medium Modified 180/200 Cutback",null,null,null,null,17,"Public transport information supply, operations and maintenance",4]
[null,null,null,null,null,null,null,null,null,null,null,"TMEH","Techniflex PM Emuls",null,null,null,null,36,"Recycle",6]
[null,null,null,null,null,null,null,null,null,null,null,null,null,null,null,null,null,1,"Regional land transport planning management",1]
[null,null,null,null,null,null,null,null,null,null,null,null,null,null,null,null,null,43,"Replacement of bridges and other structures",8]
[null,null,null,null,null,null,null,null,null,null,null,null,null,null,null,null,null,50,"Resilience",8]
[null,null,null,null,null,null,null,null,null,null,null,null,null,null,null,null,null,51,"Resilience improvements",8]
[null,null,null,null,null,null,null,null,null,null,null,null,null,null,null,null,null,45,"Road improvements",8]
[null,null,null,null,null,null,null,null,null,null,null,null,null,null,null,null,null,19,"Routine Maintenance",6]
[null,null,null,null,null,null,null,null,null,null,null,null,null,null,null,null,null,21,"Routine Maintenance",6]
[null,null,null,null,null,null,null,null,null,null,null,null,null,null,null,null,null,50,"Safety",8]
[null,null,null,null,null,null,null,null,null,null,null,null,null,null,null,null,null,46,"Seal extension",8]
[null,null,null,null,null,null,null,null,null,null,null,null,null,null,null,null,null,5,"Sector Research",1]
[null,null,null,null,null,null,null,null,null,null,null,null,null,null,null,null,null,34,"Skid Resistance",6]
[null,null,null,null,null,null,null,null,null,null,null,null,null,null,null,null,null,36,"Stabilisation Inlay (Rip & Remake)",6]
[null,null,null,null,null,null,null,null,null,null,null,null,null,null,null,null,null,37,"Structures component replacements",6]
[null,null,null,null,null,null,null,null,null,null,null,null,null,null,null,null,null,22,"Structures maintenance",6]
[null,null,null,null,null,null,null,null,null,null,null,null,null,null,null,null,null,19,"T10 treatments",6]
[null,null,null,null,null,null,null,null,null,null,null,null,null,null,null,null,null,14,"Total Mobility operations",4]
[null,null,null,null,null,null,null,null,null,null,null,null,null,null,null,null,null,16,"Total mobility wheelchair hoist use payments",4]
[null,null,null,null,null,null,null,null,null,null,null,null,null,null,null,null,null,24,"Traffic services maintenance",6]
[null,null,null,null,null,null,null,null,null,null,null,null,null,null,null,null,null,39,"Traffic services renewals",6]
[null,null,null,null,null,null,null,null,null,null,null,null,null,null,null,null,null,2,"Transport model development",1]
[null,null,null,null,null,null,null,null,null,null,null,null,null,null,null,null,null,53,"Unfunded rework",10]
[null,null,null,null,null,null,null,null,null,null,null,null,null,null,null,null,null,52,"Unfunded third party work",10]
[null,null,null,null,null,null,null,null,null,null,null,null,null,null,null,null,null,20,"Unsealed pavement maintenance",6]
[null,null,null,null,null,null,null,null,null,null,null,null,null,null,null,null,null,33,"Unsealed road metalling",6]
[null,null,null,null,null,null,null,null,null,null,null,null,null,null,null,null,null,8,"Walking facilities",3]
[null,null,null,null,null,null,null,null,null,null,null,null,null,null,null,null,null,15,"Wheelchair hoists",4]

{"sheet":"LU Footpaths","index":38,"n_rows":14,"n_cols":14,"rows_kept":14,"cut":false,"hidden":false,"merged":[]}
["Contents"]
[null,"footpath_position_code","footpath_position",null,"footpath_surf_mat_code","footpath_surf_mat",null,"footpath_use_code","pedestrian_use","scooter_use","bicycle_use",null,"purpose_code","purpose"]
[null,"E","Accessway (Ends away from road)",null,"AB","Asphaltic concrete (black)",null,5,"High","High","High",null,"F","Footpath"]
[null,"J","Accessway (Joins another road)",null,"AR","Asphaltic concrete (red)",null,1,"Low","Low","Low",null,"B","Both"]
[null,"B","Boundary",null,"C","Concrete",null,2,"Low/medium","Low/medium","Low/medium",null,"C","Cycle-way"]
[null,"K","Kerb",null,"CB","Concrete (black)",null,3,"Medium","Medium","Medium"]
[null,"L","Loop Footpath",null,"CR","Concrete (red)",null,4,"Medium/high","Medium/high","Medium/high"]
[null,"M","Middle",null,"IB","Interlocking blocks"]
[null,"R","Remote from Road",null,"M","Metal"]
[null,"U","Unknown",null,"RC","Reinforced concrete"]
[null,"W","Whole Width",null,"S","Seal"]
[null,null,null,null,"SL","Slurry Seal"]
[null,null,null,null,"T","Timber"]
[null,null,null,null,"UN","Unknown"]

{"sheet":"LU Islands","index":39,"n_rows":10,"n_cols":9,"rows_kept":10,"cut":false,"hidden":false,"merged":[]}
["Contents"]
[null,"island_type_code","island_type",null,"island_shape_code","island_shape",null,"island_mat_code","island_mat"]
[null,"KERB","Kerb Build out for Pedestrian Crossings",null,"OTHER","Other",null,"GRASS","Area of Grass"]
[null,"MED","Median",null,"POLY","Polygon",null,"PAVE","Area of Paving"]
[null,"OTHER","Other",null,"ROUND","Round",null,"HSBLK","Hard Surface - Block"]
[null,"REFUG","Refuge island",null,"SQARE","Square",null,"HSCON","Hard Surface - Concrete"]
[null,"ROT","Rotary",null,"TRIA","Triangular",null,"HSOTH","Hard Surface - Other"]
[null,"SPLIT","Splitter",null,"UKN","Unknown",null,"OTHER","Other"]
[null,"THRT","Throat",null,null,null,null,"LAND","Planted Landscaping"]
[null,null,null,null,null,null,null,"UKN","Unknown"]

{"sheet":"LU ITS","index":40,"n_rows":144,"n_cols":36,"rows_kept":144,"cut":false,"hidden":false,"merged":[]}
["Contents"]
[null,"nma_code","nma",null,"its_type_code","its_type",null,"its_subtype_code","its_subtype",null,"its_make_code","its_make",null,"its_model_code","its_model",null,"supplier_code","supplier",null,"support_type_code","support_type",null,"owner_code","owner",null,"control_system_code","control_system",null,"comms_code","comms",null,"contract_mgd_by_code","contract_mgd_by",null,"its_state_code","its_state"]
[null,8,"Tauranga City",null,1,"Camera",null,1,"CCTV Camera",null,1,"3M",null,1,"1100 Mitto",null,"3M","3M",null,"1POSTF","Single Post support - Frangible",null,"LA","Local Authority",null,"CENT","Centralo",null,"CDMA","CDMA-cellular (Telecom)",null,0,"NZTA National Office",null,1,"In Service"]
[null,9,"Bay of Plenty East",null,2,"Emergency Phone",null,2,"Analogue Video Receiver",null,2,"Aaxeon",null,2,214,null,"ACCESS","Access Security Ltd",null,"1POSTN","Single Post support - Non Frangible",null,"NZTA","NZTA",null,"DVT","DVTel",null,"DSL","DSL",null,1,"NZTA Regional Office",null,2,"In Store"]
[null,10,"Bay of Plenty West",null,3,"Electronic Signs",null,3,"Analogue Video Transmitter",null,3,"Absolyte",null,3,"32-16-98 VMS-Amber",null,"ACI","Alarm Centre Installation Ltd",null,"ARMC","Cantilever Arm off Mast",null,"OTH","Other (police etc.)",null,"DYNAC","DYNAC",null,"GSM","GSM Cellular (Vodafone)",null,2,"Metservice",null,3,"Unavailable"]
[null,null,null,null,4,"Environmental Monitoring",null,4,"ANPR Camera",null,4,"Alarm Centre Installation Ltd",null,4,"40-24-98-VMS-Amber",null,"APT","Advanced Portable Technologies Ltd",null,"ARMT","Arm on top of Mast",null,null,null,null,"JAM","Jam Logic",null,"NONE","None",null,3,"Christchurch City Council",null,4,"Disposed"]
[null,null,null,null,5,"Barriers",null,5,"CCTV Fixed Lens",null,5,"Alan Bradley",null,5,"M4200E Skyrouter (CDMA modems only)",null,"ARMITAGE","Armitage Systems",null,"BAND","Banded (onto structure / pole)",null,null,null,null,"MET","Metconnect Website",null,"FIBRE","NZTA Fibre",null,4,"Waitomo DC"]
[null,null,null,null,6,"Cabinet & Equipment",null,6,"CCTV Housing",null,6,"Aldridge Signs",null,6,"M4400E Skyrouter (XT modems only)",null,"ASHAW","Alan Shaw Electrical",null,"BRACKET","Bracket",null,null,null,null,"NONE","None",null,"OOL","OOL",null,5,"Private"]
[null,null,null,null,7,"Detection Devices (Non Camera)",null,7,"CCTV Manual Zoom Lens",null,7,"Allied Telesys",null,7,"7601E",null,"ASL","Aspect Solutions Ltd (ASL)",null,"CAB","Inside of Cabinet",null,null,null,null,"SCATS","SCATS",null,"POTS","Plain Old Telephone Service",null,6,"TDC"]
[null,null,null,null,8,"Other",null,8,"Dome Housing",null,8,"Alloy Computer Services",null,8,8500,null,"ASTUTE","Astute",null,"CANTF","Cantilever support - Fixed Frangible",null,null,null,null,"TIM","TIM",null,"RF","RF",null,7,"Rotorua Disctrict Council"]
[null,null,null,null,9,"Unknown (Temp)",null,9,"Integrated Dome Camera",null,9,"Alplug",null,9,8624,null,"ATE","Aspect Technology & Equipement Ltd",null,"CANTN","Cantilever support - Fixed Non Frangible",null,null,null,null,"TMS","TMS",null,"SAT","Satellite",null,8,"Trust Power"]
[null,null,null,null,null,null,null,10,"CCTV PTZ Camera",null,10,"Altaroute (UK)",null,10,9752.125,null,"BECA","Beca",null,"CANTR","Cantilever support - Rotating",null,null,null,null,"MACA","VMS MACA",null,"VODA","Vodafone 3G",null,9,"Tauranga City Council"]
[null,null,null,null,null,null,null,11,"CCTV PTZ Driving Unit",null,11,"Adaptive Micro Systems",null,11,"Vextor A101M",null,"BRAUMS","Braums Pty Ltd",null,"CPOST","Combination Post support - Frangible / Rotating Flange",null,null,null,null,"WWW","WWW(Internet)",null,"WAN","Wide Area Network (Ethernet)",null,10,"Unknown"]
[null,null,null,null,null,null,null,12,"CCTV PTZ Housing",null,12,"Andrews",null,12,"AT-AR440S",null,"BWARD","Brian Ward",null,"DPOSTF","Dual Post support - Frangible",null,null,null,null,null,null,null,"XT","XT-cellular (Telecom)",null,11,"Marlborough District Council"]
[null,null,null,null,null,null,null,13,"CCTV PTZ Integrated Unit",null,13,"Aspect Solutions Ltd",null,13,"AT8624T/2M-V2-40",null,"CABLE","Cable Ways",null,"DPOSTN","Dual Post support - Non Frangible"]
[null,null,null,null,null,null,null,14,"CCTV PTZ Keyboard controller",null,14,"Astron",null,14,"AT9924T",null,"CHNL10","Channel 10",null,"EPHPOLE","Emergency Phone Housing pole mount (banded)"]
[null,null,null,null,null,null,null,15,"CCTV PTZ Lens",null,15,"Aspect Technology & Equipment Ltd",null,15,"AXIS213",null,"COMP","Computer Dynamics",null,"EPHWALL","Emergency Phone Housing Wall mounted"]
[null,null,null,null,null,null,null,16,"CCTV PTZ Telemetry controller",null,16,"Axis",null,16,"BT55-12FT",null,"CONN","Connector Systems",null,"FOLD","15m Folding CCTV Pole"]
[null,null,null,null,null,null,null,17,"Split Dome Camera",null,17,"Beca",null,17,"CM6800E 48x8",null,"CRTS","Combined Road & Traffic Services",null,"INTSUP","Integrated Support (Camera)"]
[null,null,null,null,null,null,null,18,"Video Decoder",null,18,"Band Pass",null,18,"CTV100BTFX/W2",null,"CSL","CSL",null,"MAST","Mast"]
[null,null,null,null,null,null,null,19,"Video Encoder",null,19,"Bosch",null,19,"D1010",null,"CSP","CSP",null,"MPOSTF","Multiple Post support - Frangible"]
[null,null,null,null,null,null,null,20,"Video Image Processor Board",null,20,"BP Solar",null,20,"D2125",null,"CUR","Currie Electrical Ltd",null,"MPOSTN","Multiple Post support - Non Frangible"]
[null,null,null,null,null,null,null,21,"Video Recorder",null,21,"Cable Ways",null,21,"D8030",null,"DAK","Daktronics",null,"NONE","No Support"]
[null,null,null,null,null,null,null,22,"Video Transceiver",null,22,"Cisco",null,22,"Dinion XF D/N IP",null,"DOVE","Dove Electronics",null,"PEDMF","Emergency Phone Pedestal Mount (Mains) Frangible"]
[null,null,null,null,null,null,null,23,"Virtual Cameras",null,23,"Clearsonics",null,23,"DRD11A",null,"EGLEY","Egley Electrical",null,"PEDMN","Emergency Phone Pedestal Mount (Mains) Non Frangible"]
[null,null,null,null,null,null,null,24,"Emergency Phone Battery",null,24,"Cell Reach",null,24,"Datataker DT50",null,"ELECHB","Electricians HB",null,"PEDSF","Emergency Phone Pedestal Mount (Solar) Frangible"]
[null,null,null,null,null,null,null,25,"Emergency Phone VCE GSM",null,25,"Clipsal",null,25,"DVT EZ201-0",null,"ELITE","Elite Doors",null,"PEDSN","Emergency Phone Pedestal Mount (Solar) Non Frangible"]
[null,null,null,null,null,null,null,26,"Emergency Phone Hardware",null,26,"Campbell Scientific",null,26,"DVT7401 E",null,"ELWC","ELWC Australia",null,"POLE","Pole Mount (Camera)"]
[null,null,null,null,null,null,null,27,"Emergency Phone (old)",null,27,"Commander",null,27,"DVT7601 E",null,"ENGCS","Engineering Computer Services",null,"RACK","Rack Mount (equipment)"]
[null,null,null,null,null,null,null,28,"Emergency Phone VCE VoIP",null,28,"Commscope",null,28,"DVT7801 E",null,"ETL","ETL Systems",null,"STAND","Standoff attached to structure"]
[null,null,null,null,null,null,null,29,"Advanced Warning Sign",null,29,"Connection Technology Systems",null,29,"DVT7801 PEA",null,"FH","Fulton Hogan",null,"UPOSTF","U-Shape support - Frangible"]
[null,null,null,null,null,null,null,30,"Changeable Message Sign",null,30,"Combined Road & Traffic Services",null,30,"ECO-TWIN",null,"FUSION","Fusion Systems",null,"UPOSTN","U-Shape support - Non Frangible"]
[null,null,null,null,null,null,null,31,"Lane Control Device",null,31,"Ctek Inc",null,31,"EH2512-EH2500 Series Enclosure",null,"GE","General Electric",null,"WALK","Walkway Bracket"]
[null,null,null,null,null,null,null,32,"Lane Signal Units",null,32,"Coaxial",null,32,"EH2515",null,"GENI","Geni"]
[null,null,null,null,null,null,null,33,"Mobile VMS (MVMS)",null,33,"Daktronics",null,33,"EH3515-2",null,"GILBERT","Gilbert Sheet Metals"]
[null,null,null,null,null,null,null,34,"Other Safety Signs",null,34,"Digi",null,34,"EP1000LRT",null,"HILLS","Hills Security"]
[null,null,null,null,null,null,null,35,"School Zone Sign",null,35,"Ditech",null,35,"ES31C22-2N-X",null,"HMI","HMI Technologies"]
[null,null,null,null,null,null,null,36,"Speed Indication Device",null,36,"Direct Logic",null,36,"ES31CBW35",null,"HTL","Harding Traffic Ltd"]
[null,null,null,null,null,null,null,37,"Variable Message Sign",null,37,"DVTel",null,37,"Esprite",null,"HYNDS","Hynds"]
[null,null,null,null,null,null,null,38,"Variable Mandatory Speed Sign",null,38,"Ecocounter",null,38,"FCHA1-M1T-WSE",null,"INTEK","Intek"]
[null,null,null,null,null,null,null,39,"Variable Speed Sign",null,39,"EIS",null,39,"FCHA1-DB1-M1T-MSE",null,"INZ","Inzone"]
[null,null,null,null,null,null,null,40,"Environmental Stn",null,40,"Electrex",null,40,"FCU18025SC-S15",null,"ITS","ITS"]
[null,null,null,null,null,null,null,41,"Humidity Device",null,41,"Emerson",null,41,"FD12",null,"MET","Metservice"]
[null,null,null,null,null,null,null,42,"Rainfall Meter",null,42,"Enatel",null,42,"G4 Dome",null,"MROLA","Motorola"]
[null,null,null,null,null,null,null,43,"Sound Device",null,43,"Erico",null,43,"Generic Prism CMS",null,"NUT","Nutech Security"]
[null,null,null,null,null,null,null,44,"Temperature Device",null,44,"Electronic Transformer Engineering",null,44,"GXT2-1500 RT0230",null,"NZMETAL","Local NZ Metalwork Shop"]
[null,null,null,null,null,null,null,45,"Weather Station",null,45,"Eaton",null,45,"GXT2-V8VBATT",null,"OPTIM","Optimal Power"]
[null,null,null,null,null,null,null,46,"Wind Monitor",null,46,"Exicom",null,46,"H6ZE-R",null,"PHIL","Philips"]
[null,null,null,null,null,null,null,47,"Automated Barriers",null,47,"Fluidmesh",null,47,"HD_S125 Smart Sensor",null,"POWER","Power Electrical Contractors"]
[null,null,null,null,null,null,null,48,"Emergency Access Gate",null,48,"Flexicom",null,48,"HIPath 3300/3500",null,"PTECH","Powertech Nelson"]
[null,null,null,null,null,null,null,49,"Swift Gates",null,49,"Formolite",null,49,"HZC 10/200",null,"RITTAL","Rittal"]
[null,null,null,null,null,null,null,50,"Other Communications Device",null,50,"Fuse",null,50,"KBD-300A",null,"RTL","RTL"]
[null,null,null,null,null,null,null,51,"ATMS Node Cabinet",null,51,"General Electric",null,51,"LC903P-B",null,"SIGNOPS","Signopsys Electronic Signs"]
[null,null,null,null,null,null,null,52,"Battery",null,52,"Generic",null,52,"LCP903P-B",null,"SOUND","Sound Logic Systems"]
[null,null,null,null,null,null,null,53,"Cellular Modem",null,53,"Gilbert Sheet Metals",null,53,"LTC0498/11",null,"SPUN","Spunlite"]
[null,null,null,null,null,null,null,54,"Chassis Rack",null,54,"GoldenLeaf",null,54,"LTC3374/21 5-50mm 1:1.4",null,"STS","Struthers Security"]
[null,null,null,null,null,null,null,55,"Mobile Dynamic Message Sign Controller",null,55,"Golden River",null,55,"LTC3674/20",null,"TCS","Traffic Control Systems"]
[null,null,null,null,null,null,null,56,"DSL Modem",null,56,"Guardian",null,56,"LTC610",null,"TFD","Transfield Services"]
[null,null,null,null,null,null,null,57,"Ethernet Core Switch",null,57,"Harvest Electronics",null,57,"LTC9215/00",null,"TRA","Traffic Systems"]
[null,null,null,null,null,null,null,58,"Ethernet Edge Switch",null,58,"Haze",null,58,"LVC-C553HP (PAL)",null,"TRAF","Traficon"]
[null,null,null,null,null,null,null,59,"Full Size ATMS Cabinet",null,59,"Helios Technologies",null,59,"Marksman 720",null,"TS","Traffic Signs NZ Ltd"]
[null,null,null,null,null,null,null,60,"Wireless Hub",null,60,"Hi Tech",null,60,"MC103XL-40",null,"TYCO","Tyco"]
[null,null,null,null,null,null,null,61,"Isolating Transformer",null,61,"HMI Technologies",null,61,"MS3 - Bespoke Full Size",null,"UNK","Unknown"]
[null,null,null,null,null,null,null,62,"LSU Power Enclosure",null,62,"Hengstier",null,62,"MS3 - Bespoke Small",null,"ZONE","Zone Technology"]
[null,null,null,null,null,null,null,63,"Matrix Switch",null,63,"Harding Traffic Ltd",null,63,"MX4016CS-X"]
[null,null,null,null,null,null,null,64,"Media Converter",null,64,"Hewlett Packard",null,64,"Not Applicable"]
[null,null,null,null,null,null,null,65,"Mini ATMS Cabinet",null,65,"Innovative Battery Technology",null,65,"NDN-948V03-11PS"]
[null,null,null,null,null,null,null,66,"Mini Cabinet",null,66,"International Fibre Systems",null,66,"NPort 5100 series"]
[null,null,null,null,null,null,null,67,"Multiplexer",null,67,"Ikigami",null,67,"NTCIP VMSS"]
[null,null,null,null,null,null,null,68,"OHDS Controller",null,68,"Jaycar",null,68,"OSD 420 Tx/Rx"]
[null,null,null,null,null,null,null,69,"Remote Reboot Unit",null,69,"James Hardie",null,69,"OSD370 19\"\" 3RU"]
[null,null,null,null,null,null,null,70,"Regional VMS Cabinet",null,70,"KBC Networks",null,70,"Axis P3343-VE"]
[null,null,null,null,null,null,null,71,"SCATS Comm",null,71,"Kathrein",null,71,"Axis P5512-E"]
[null,null,null,null,null,null,null,72,"Serial Server",null,72,"LG",null,72,"PDR-9LX 750GB"]
[null,null,null,null,null,null,null,73,"Signal Controller Cabinet",null,73,"Li COR",null,73,"PIH-6032"]
[null,null,null,null,null,null,null,74,"SNMP UPS",null,74,"CS Linin",null,74,"Rimco 8020"]
[null,null,null,null,null,null,null,75,"Solar Panel",null,75,"MagDrive",null,75,"REG-L1875"]
[null,null,null,null,null,null,null,76,"Standard UPS",null,76,"Match",null,76,"RTMS K3 IP"]
[null,null,null,null,null,null,null,77,"UPS Batteries",null,77,"McFarlanes",null,77,"SDIII WV-CP484"]
[null,null,null,null,null,null,null,78,"VDSL Modem",null,78,"McVan Instruments",null,78,"SMCFS5"]
[null,null,null,null,null,null,null,79,"VMS Controller - Master",null,79,"Micronet",null,79,"SP3105AS"]
[null,null,null,null,null,null,null,80,"VMS Controller - NTCIP",null,80,"Mitsubishi",null,80,"SPE Modem"]
[null,null,null,null,null,null,null,81,"Continuous Inductive Loop Detector",null,81,"MOXA",null,81,"Spectra IV SD435-F1-X"]
[null,null,null,null,null,null,null,82,"Ice Detection System",null,82,"Motorola",null,82,"Spectra IV SD435-PG-E1-X"]
[null,null,null,null,null,null,null,83,"Loop",null,83,"Not Applicable",null,83,"SSC DC83P"]
[null,null,null,null,null,null,null,84,"Loop Controller",null,84,"Narada",null,84,"TC450SR"]
[null,null,null,null,null,null,null,85,"Non Continuous Inductive Loop Detector",null,85,"Local NZ Metalwork Shop",null,85,"UCL900DM / WYA904"]
[null,null,null,null,null,null,null,86,"Over-Height Detection Beam Sensor",null,86,"O Gara",null,86,"Unknown"]
[null,null,null,null,null,null,null,87,"Other Detection Device",null,87,"Optimal Power",null,87,"UP80E"]
[null,null,null,null,null,null,null,88,"PLC Controller",null,88,"Optical Systems Design",null,88,"VDT14130"]
[null,null,null,null,null,null,null,89,"Radar",null,89,"Pacific Communications",null,89,"VF1000-18-90-18R"]
[null,null,null,null,null,null,null,90,"Side Mounted Radar",null,90,"Panasonic",null,90,"VF1000-27x105-12-R"]
[null,null,null,null,null,null,null,91,"Trigger Arm",null,91,"PAT",null,91,"VF1000-27x105-18-R"]
[null,null,null,null,null,null,null,92,"Weigh in Motion",null,92,"Pelco",null,92,"VG4-513-ECSOP"]
[null,null,null,null,null,null,null,93,"Cabling",null,93,"Pelican",null,93,"VIPX1"]
[null,null,null,null,null,null,null,94,"Miscellaneous Non NZTA Asset",null,94,"Pentax",null,94,"VIPX1 Integrated"]
[null,null,null,null,null,null,null,95,"Other Signals",null,95,"Philips",null,95,"VMS Type A"]
[null,null,null,null,null,null,null,96,"Traffic Data Collection",null,96,"Phoenix Contact",null,96,"VMS Type B"]
[null,null,null,null,null,null,null,97,"Traffic Signal Head",null,97,"Projecta",null,97,"VMS Type C"]
[null,null,null,null,null,null,null,98,"Traffic Signals",null,98,"Power Save",null,98,"VMS Type D"]
[null,null,null,null,null,null,null,99,"Wireless Vehicle Tracking Systems",null,99,"Powertech",null,99,"VMS Type F"]
[null,null,null,null,null,null,null,100,"Weigh Station",null,100,"QTC",null,100,"VMSS-21X30-9-R"]
[null,null,null,null,null,null,null,101,"Unknown (Temp)",null,101,"Reid Technologies",null,101,"VR100"]
[null,null,null,null,null,null,null,null,null,null,102,"Rittal",null,102,"VR1530"]
[null,null,null,null,null,null,null,null,null,null,103,"RM Young",null,103,"VR1810"]
[null,null,null,null,null,null,null,null,null,null,104,"RTL",null,104,"VR1910"]
[null,null,null,null,null,null,null,null,null,null,105,"Scott Technical Instruments",null,105,"VR7830"]
[null,null,null,null,null,null,null,null,null,null,106,"Seikou",null,106,"Vision SID"]
[null,null,null,null,null,null,null,null,null,null,107,"Sensable Sensors",null,107,"VT1010"]
[null,null,null,null,null,null,null,null,null,null,108,"Sick",null,108,"VT1530"]
[null,null,null,null,null,null,null,null,null,null,109,"Siemens",null,109,"VT1910"]
[null,null,null,null,null,null,null,null,null,null,110,"Signopsys Electronic Signs",null,110,"VT7230"]
[null,null,null,null,null,null,null,null,null,null,111,"Smart",null,111,"VT7430"]
[null,null,null,null,null,null,null,null,null,null,112,"SMC",null,112,"Vector W200P"]
[null,null,null,null,null,null,null,null,null,null,113,"Solarex",null,113,"WS/WE45"]
[null,null,null,null,null,null,null,null,null,null,114,"Sony",null,114,"CS Autodome 600"]
[null,null,null,null,null,null,null,null,null,null,115,"Sound Logic Systems",null,115,"B31206"]
[null,null,null,null,null,null,null,null,null,null,116,"Spunlite",null,116,"Bosh 300 Series 18xD/N Envirodome"]
[null,null,null,null,null,null,null,null,null,null,117,"Still Air",null,117,"ECPGNVANA 7040140"]
[null,null,null,null,null,null,null,null,null,null,118,"Suntech",null,118,"ESMW03"]
[null,null,null,null,null,null,null,null,null,null,119,"SUNX",null,119,"ESMW04"]
[null,null,null,null,null,null,null,null,null,null,120,"Sixnet",null,120,"Quasar CP-3211-181"]
[null,null,null,null,null,null,null,null,null,null,121,"Tait",null,121,"VMS 18-400"]
[null,null,null,null,null,null,null,null,null,null,122,"Termopto",null,122,"F05302610"]
[null,null,null,null,null,null,null,null,null,null,123,"Trace",null,123,"ECX2-62G-8-16"]
[null,null,null,null,null,null,null,null,null,null,124,"Traficon",null,124,5230]
[null,null,null,null,null,null,null,null,null,null,125,"Trans Pac",null,125,"ES41E36"]
[null,null,null,null,null,null,null,null,null,null,126,"Trio Communications",null,126,"ES5230-12N"]
[null,null,null,null,null,null,null,null,null,null,127,"TriStar",null,127,"FM1200V-HW"]
[null,null,null,null,null,null,null,null,null,null,128,"Transition Networks"]
[null,null,null,null,null,null,null,null,null,null,129,"Tyco"]
[null,null,null,null,null,null,null,null,null,null,130,"Unidata"]
[null,null,null,null,null,null,null,null,null,null,131,"Unknown"]
[null,null,null,null,null,null,null,null,null,null,132,"Vaisala"]
[null,null,null,null,null,null,null,null,null,null,133,"Ver-Mac"]
[null,null,null,null,null,null,null,null,null,null,134,"Viasat"]
[null,null,null,null,null,null,null,null,null,null,135,"Viasis"]
[null,null,null,null,null,null,null,null,null,null,136,"VMSL"]
[null,null,null,null,null,null,null,null,null,null,137,"Wanco Inc Denver Colorado"]
[null,null,null,null,null,null,null,null,null,null,138,"Wavetronics"]
[null,null,null,null,null,null,null,null,null,null,139,"Wema"]
[null,null,null,null,null,null,null,null,null,null,140,"WTI"]
[null,null,null,null,null,null,null,null,null,null,141,"Hynds"]
[null,null,null,null,null,null,null,null,null,null,142,"SWARCO"]

{"sheet":"LU Streetlights","index":41,"n_rows":79,"n_cols":21,"rows_kept":79,"cut":false,"hidden":false,"merged":[]}
["Contents"]
[null,"bracket_type_code","bracket_type",null,"coating_code","coating",null,"owner_code","owner",null,"light_make_code","light_make",null,"light_model_code","light_model",null,"supply_point_code","supply_point",null,"Light Shade","Light Shade2"]
[null,"ACD","Arm, curved, double",null,"EPOX","Epoxy Paint System",null,"AM","Amenity and Accessway",null,"ADLT","Advanced Lighting",null,"AMB1","Ambar 150 Curved",null,"UN","Unknown",null,"L","Large"]
[null,"ACQ","Arm, curved, quadruple",null,"GALV","Galvanised",null,"TZ","Horizon",null,"AEC","AEC",null,"AMB2","Ambar 250 Curved",null,"MB","Montrose Box",null,"N","None"]
[null,"ACS","Arm, curved, single",null,"GALE","Galvanised & Epoxy",null,"HE","Housing for the elderly",null,"BOL","Bollard",null,"ADEC","Architect/decor.",null,"OH","Overhead",null,"S","Small"]
[null,"AED","Arm, elliptical, double",null,"NONE","None",null,"LA","Local Authority",null,"COR","Corysal",null,"ADEC","Architectural / decorative",null,"UG","Underground",null,"U","Unknown"]
[null,"AES","Arm, elliptical, single",null,"PCOT","Powder coated",null,"TR","NZTA",null,"GEC","GEC",null,"ADEC","Architectural / decorative"]
[null,"AMD","Arm, mitred, double",null,"RHI","Rhino Coating",null,"O","Other",null,"GT","Gentana",null,"ADEC","Architectural / decorative"]
[null,"AMS","Arm, mitred, single",null,"TP","Tape & Paint",null,"PA","Parks",null,"GO","Gough",null,"ADEC","Architectural / decorative"]
[null,"BCF","Bracket, curved, front mounted",null,null,null,null,"PB","Power Board",null,"GUES","Gues",null,"ADEC","Architectural / decorative"]
[null,"BFX","Bracket, flat, X-arm mounted",null,null,null,null,"PR","Property",null,"ITA","ITALO",null,"ADEC","Architectural / decorative"]
[null,"BMF","Bracket, mitred, front mt",null,null,null,null,"RO","Roading",null,"KL","Kendelier Lighting",null,"ADEC","Architectural / decorative"]
[null,"BMS","Bracket, mitred, side mt",null,null,null,null,"TC","Telecom",null,"PHIL","Philips",null,2222,"B2222"]
[null,"CA","Cross Arm Mounted Pipe",null,null,null,null,"TS","Traffic",null,"R","Ruud",null,2224,"B2224"]
[null,"DPTD","Decor, pole top light, double",null,null,null,null,"UN","United Network Ltd",null,"RD","Ruud",null,2225,"B2225"]
[null,"DPTS","Decor, pole top light, single",null,null,null,null,"U","Unknown",null,"SCH","Schreder",null,"B7","B2227"]
[null,"DCD","Decorative, curved, double",null,null,null,null,"VO","Vodafone",null,"SYLV","Sylvania",null,2229,"B2229"]
[null,"DCS","Decorative, curved, single",null,null,null,null,null,null,null,"THN","Thorn",null,3000,"B3000"]
[null,"DFD","Decorative, flat, double",null,null,null,null,null,null,null,"UNK","Unknown",null,"B0","B3000"]
[null,"DFC","Decorative, flat, single",null,null,null,null,null,null,null,"VC","Vision Concepts",null,"BB","Belisha Beacon"]
[null,"DC","Double curved",null,null,null,null,null,null,null,null,null,null,"B79","Beta 79"]
[null,"DE","Double Eliptical",null,null,null,null,null,null,null,null,null,null,"B","Bollard"]
[null,"DM","Double Mitred",null,null,null,null,null,null,null,null,null,null,"BL","Bulkhead"]
[null,"FMS","Front Mount Straight",null,null,null,null,null,null,null,null,null,null,"R47","Cobra"]
[null,"FMA","Front Mounted Angle",null,null,null,null,null,null,null,null,null,null,"COR","Coronet Pedestrian Flood Light"]
[null,"FMC","Front Mounted Curved",null,null,null,null,null,null,null,null,null,null,"COR","Corysal"]
[null,"NB","No Bracket",null,null,null,null,null,null,null,null,null,null,"DM","Diadem"]
[null,"NO","No Bracket",null,null,null,null,null,null,null,null,null,null,"FLDL","Floodlight"]
[null,"PCS","Pole Cap Standard",null,null,null,null,null,null,null,null,null,null,"FLDL","Floodlight"]
[null,"PCT","Pole Cap Tall",null,null,null,null,null,null,null,null,null,null,"FLDL","Floodlight"]
[null,"PT","Post Top",null,null,null,null,null,null,null,null,null,null,"FLDL","Floodlight"]
[null,"RTS","Reticulation Standard",null,null,null,null,null,null,null,null,null,null,"FLOO","Floodlight (at weighstations)"]
[null,"RTT","Reticulation Tall",null,null,null,null,null,null,null,null,null,null,"FLOO","Floodlight (at weighstations)"]
[null,"SC","Single curved",null,null,null,null,null,null,null,null,null,null,"FLOA","Floodlight e.g. like at ICB"]
[null,"SE","Single Eliptical",null,null,null,null,null,null,null,null,null,null,"GL5","GL500"]
[null,"SM","Single Mitred",null,null,null,null,null,null,null,null,null,null,"GL6","GL600"]
[null,"SBB","Specific, belisha beacon",null,null,null,null,null,null,null,null,null,null,"GL7","GL700"]
[null,"SB","Specific, bollard",null,null,null,null,null,null,null,null,null,null,"GLEC","GLEC"]
[null,"SBD","Specific, building,double",null,null,null,null,null,null,null,null,null,null,"G500","Goughlite 500"]
[null,"SO","Specific, other",null,null,null,null,null,null,null,null,null,null,"G520","Goughlite 520"]
[null,"SOS","Specific, other,single",null,null,null,null,null,null,null,null,null,null,"G600","Goughlite 600"]
[null,"SPL","Specific, ped. xing spot light",null,null,null,null,null,null,null,null,null,null,"G630","Goughlite 630"]
[null,"TMC","Top Mount Curved",null,null,null,null,null,null,null,null,null,null,"G700","Goughlite 700"]
[null,"TMS","Top Mount Straight",null,null,null,null,null,null,null,null,null,null,"EC","Goughlite EC"]
[null,"TC","Triple Curved",null,null,null,null,null,null,null,null,null,null,"ECA","Goughlite EC (aeroscreen)"]
[null,"UKN","Unknown",null,null,null,null,null,null,null,null,null,null,"HER","Heron (twin fluorescent)"]
[null,"UN","Unknown",null,null,null,null,null,null,null,null,null,null,"HM","Himast"]
[null,null,null,null,null,null,null,null,null,null,null,null,null,"IT1","ITALO 1"]
[null,null,null,null,null,null,null,null,null,null,null,null,null,"IT2","ITALO 2"]
[null,null,null,null,null,null,null,null,null,null,null,null,null,"K1","KAOS1"]
[null,null,null,null,null,null,null,null,null,null,null,null,null,"K2","KAOS2"]
[null,null,null,null,null,null,null,null,null,null,null,null,null,"KO","Kowai"]
[null,null,null,null,null,null,null,null,null,null,null,null,null,"K200","Kowhai (135W SOX Lamp)"]
[null,null,null,null,null,null,null,null,null,null,null,null,null,"K100","Kowhai (90W SOX Lamp)"]
[null,null,null,null,null,null,null,null,null,null,null,null,null,"MU","Maxi urban"]
[null,null,null,null,null,null,null,null,null,null,null,null,null,"OPTA","Optima (intermediate road)"]
[null,null,null,null,null,null,null,null,null,null,null,null,null,"OM","Optimum"]
[null,null,null,null,null,null,null,null,null,null,null,null,null,"OPTM","Optimum (minor road)"]
[null,null,null,null,null,null,null,null,null,null,null,null,null,"OP","Optispan"]
[null,null,null,null,null,null,null,null,null,null,null,null,null,"OPTS","Optispan (main road)"]
[null,null,null,null,null,null,null,null,null,null,null,null,null,"PGL7","Pedestrian GL700"]
[null,null,null,null,null,null,null,null,null,null,null,null,null,"SL","Pedestrian spot light"]
[null,null,null,null,null,null,null,null,null,null,null,null,null,"SL","Pedestrian spot light"]
[null,null,null,null,null,null,null,null,null,null,null,null,null,"SL","Pedestrian spot light"]
[null,null,null,null,null,null,null,null,null,null,null,null,null,"PTL","Pole Top Light"]
[null,null,null,null,null,null,null,null,null,null,null,null,null,"UB25","PR525 250 underbridge"]
[null,null,null,null,null,null,null,null,null,null,null,null,null,"RR","Rama / Radiata"]
[null,null,null,null,null,null,null,null,null,null,null,null,null,"RD","Roadster"]
[null,null,null,null,null,null,null,null,null,null,null,null,null,"RDF","Roadster Forward Throw"]
[null,null,null,null,null,null,null,null,null,null,null,null,null,"SP1","SP1"]
[null,null,null,null,null,null,null,null,null,null,null,null,null,"SP2","SP2"]
[null,null,null,null,null,null,null,null,null,null,null,null,null,"SP3","SP3"]
[null,null,null,null,null,null,null,null,null,null,null,null,null,"TANG","Tango"]
[null,null,null,null,null,null,null,null,null,null,null,null,null,"TCH","Techlight"]
[null,null,null,null,null,null,null,null,null,null,null,null,null,"UNK","Unknown"]
[null,null,null,null,null,null,null,null,null,null,null,null,null,"UNK","Unknown"]
[null,null,null,null,null,null,null,null,null,null,null,null,null,"UR","Urban"]
[null,null,null,null,null,null,null,null,null,null,null,null,null,450,"VC 450"]
[null,null,null,null,null,null,null,null,null,null,null,null,null,"UB15","WAC415 150 underbridge"]

{"sheet":"LU Retaining_Walls","index":42,"n_rows":24,"n_cols":3,"rows_kept":24,"cut":false,"hidden":false,"merged":[]}
["Contents"]
[null,"ret_wall_type_code","ret_wall_type"]
[null,"ANCH","Anchored"]
[null,"BIN","Bin"]
[null,"BSTNE","Blue Stone"]
[null,"CANT","Cantilever"]
[null,"CONC","Concrete"]
[null,"COUNT","Counterfort"]
[null,"CRIB2","Double Crib"]
[null,"GABN","Gabion"]
[null,"GRAV","Gravity"]
[null,"KBLK","Keystone Block"]
[null,"MBLK","Mass Block"]
[null,"MCRIB","Minicrib"]
[null,"PILEP","Pile and Panels"]
[null,"PILES","Piles"]
[null,"EARTH","Reinforced Earth"]
[null,"ROCK","Rock"]
[null,"ROCKA","Rock Anchor"]
[null,"PILED","Sheet Pile"]
[null,"CRIB1","Single Crib"]
[null,"SOILN","Soil Nails"]
[null,"SPEC","Special Design"]
[null,"CRIB3","Triple Crib"]

{"sheet":"LU Minor_Structures","index":43,"n_rows":28,"n_cols":3,"rows_kept":28,"cut":false,"hidden":false,"merged":[]}
["Contents"]
[null,"ms_material_code","ms_material"]
[null,"ALUM","Aluminium"]
[null,"ARMCO","Armco"]
[null,"BLOCK","Block"]
[null,"BRICK","Brick"]
[null,"BRONZ","Bronze"]
[null,"CAST","Cast Iron - Decorative"]
[null,"CON","Concrete"]
[null,"CONGS","Concrete and Galvanised Steel"]
[null,"CONST","Concrete and Steel"]
[null,"EARTH","Earth"]
[null,"FIBRE","Fibreglass"]
[null,"GALV","Galvanised Steel"]
[null,"GEOTX","Geotextile"]
[null,"GLASS","Glass"]
[null,"GRANT","Granite"]
[null,"RUBBR","High Density Rubber"]
[null,"MARBL","Marble"]
[null,"PLAS","Plastic"]
[null,"PCS","Powder Coated Steel"]
[null,"ROCK","Rock"]
[null,"STEEL","Steel"]
[null,"STW","Steel and wood"]
[null,"COMP","Steel Composite"]
[null,"DRUM","Steel Drum"]
[null,"STONE","Stone"]
[null,"WOOD","Wood"]